wxDev-C++ for Visual C++

If you are using wxDev-C++ for your wxWidgets design, please ask your questions here instead of in IDE Related.
ross
Experienced Solver
Experienced Solver
Posts: 74
Joined: Tue Sep 14, 2004 12:09 am
Location: Australia

Post by ross » Tue Jun 27, 2006 6:03 am

lowjoel wrote:Probably was my mistake when packaging the alpha. Ill see if i can build one in an hour or so when I'm done with my assignment.

Joel
Could you put a message here when your done. Would i have to install the whole thing again?

lowjoel
Moderator
Moderator
Posts: 1511
Joined: Sun Jun 19, 2005 11:37 am
Location: Singapore
Contact:

Post by lowjoel » Tue Jun 27, 2006 12:26 pm

Go try the new alpha. Thanks

P/s next time please email me, it's probably faster.

lowjoel
Moderator
Moderator
Posts: 1511
Joined: Sun Jun 19, 2005 11:37 am
Location: Singapore
Contact:

Post by lowjoel » Tue Jun 27, 2006 3:03 pm

And for the issue regarding the devpaks, see this screenshot:
Image

Uncheck all of the checkmarks for the devpaks and they won't be downloaded

ross
Experienced Solver
Experienced Solver
Posts: 74
Joined: Tue Sep 14, 2004 12:09 am
Location: Australia

Post by ross » Tue Jun 27, 2006 9:50 pm

Many Thanks Joel

ross
Experienced Solver
Experienced Solver
Posts: 74
Joined: Tue Sep 14, 2004 12:09 am
Location: Australia

Post by ross » Tue Jun 27, 2006 10:21 pm

Just a note your link to instructions:

http://wxdsgn.sourceforge.net/tutorial/ ... tions.html

seems to be broken

ross
Experienced Solver
Experienced Solver
Posts: 74
Joined: Tue Sep 14, 2004 12:09 am
Location: Australia

Post by ross » Tue Jun 27, 2006 10:38 pm

Ok Joel it no longer crashes :)

Now I'm getting a load of errors related to gcc such as:

In file included from C:/wxDev-C++/Bin/../lib/gcc/mingw32/3.4.2/../../../../include/wx/string.h:170,

I guess this is because I'm setting something wrong in the project options, but what I've no idea. I have all the gcc stuff last but there must be something I'm missing.

lowjoel
Moderator
Moderator
Posts: 1511
Joined: Sun Jun 19, 2005 11:37 am
Location: Singapore
Contact:

Post by lowjoel » Wed Jun 28, 2006 1:19 pm

In aall those includes, what is the first error? Please post your build log.

ross
Experienced Solver
Experienced Solver
Posts: 74
Joined: Tue Sep 14, 2004 12:09 am
Location: Australia

Post by ross » Tue Jul 04, 2006 6:12 am

Hi Joel,

Still having problems. Now I'm getting an error:

Application failes to start because mspdb71.dll was not found.

The file is there but for some is not finding it. If you could put up your instruction page again that would be good. Just as a check for the right path settings.

Finally i get this

C:\wxDev-C++\libc_dll

which does not look good after using the env setp program. Should this be \lib\vc_dll?

ross
Experienced Solver
Experienced Solver
Posts: 74
Joined: Tue Sep 14, 2004 12:09 am
Location: Australia

Post by ross » Tue Jul 04, 2006 7:07 am

Now i get loads of errors
Heres my log.

Any thoughts?

Compiler: vc2003
Building Makefile: "C:\wxDev-C++\Projects\p1\Makefile.win"
Executing make...
make.exe -f "C:\wxDev-C++\Projects\p1\Makefile.win" all
g++.exe /nologo /c Project1App.cpp /FoProject1App.obj /I"include" /I"C:/Program Files/Microsoft Platform SDK/Include" /I"C:/wxDev-C++/include" /D_UNICODE /D__WXMSW__ /DWIN32 /DWXUSINGDLL /D_WIN32_IE=0x0600 /DwxUSE_UNICODE_MSLU=1 /EHa /QIfdiv /QI0f /QIfist /Ze

In file included from C:/wxDev-C++/bin/../lib/gcc/mingw32/3.4.2/../../../../include/wx/string.h:170,
from C:/wxDev-C++/bin/../lib/gcc/mingw32/3.4.2/../../../../include/wx/memory.h:16,
from C:/wxDev-C++/bin/../lib/gcc/mingw32/3.4.2/../../../../include/wx/object.h:21,

from C:/wxDev-C++/bin/../lib/gcc/mingw32/3.4.2/../../../../include/wx/wx.h:16,
from Project1App.h:18,
from Project1App.cpp:10:
C:/wxDev-C++/bin/../lib/gcc/mingw32/3.4.2/../../../../include/string:45:28: bits/c++config.h: No such file or directory
In file included from C:/wxDev-C++/bin/../lib/gcc/mingw32/3.4.2/../../../../include/bits/stl_algobase.h:70,
from C:/wxDev-C++/bin/../lib/gcc/mingw32/3.4.2/../../../../include/bits/char_traits.h:46,
from C:/wxDev-C++/bin/../lib/gcc/mingw32/3.4.2/../../../../include/string:47,
from C:/wxDev-C++/bin/../lib/gcc/mingw32/3.4.2/../../../../include/wx/string.h:170,
from C:/wxDev-C++/bin/../lib/gcc/mingw32/3.4.2/../../../../include/wx/memory.h:16,
from C:/wxDev-C++/bin/../lib/gcc/mingw32/3.4.2/../../../../include/wx/object.h:21,
from C:/wxDev-C++/bin/../lib/gcc/mingw32/3.4.2/../../../../include/wx/wx.h:16,
from Project1App.h:18,
from Project1App.cpp:10:
C:/wxDev-C++/bin/../lib/gcc/mingw32/3.4.2/../../../../include/iosfwd:46:29: bits/c++locale.h: No such file or directory
C:/wxDev-C++/bin/../lib/gcc/mingw32/3.4.2/../../../../include/iosfwd:47:25: bits/c++io.h: No such file or directory
In file included from C:/wxDev-C++/bin/../lib/gcc/mingw32/3.4.2/../../../../include/bits/postypes.h:46,
from C:/wxDev-C++/bin/../lib/gcc/mingw32/3.4.2/../../../../include/iosfwd:50,
from C:/wxDev-C++/bin/../lib/gcc/mingw32/3.4.2/../../../../include/bits/stl_algobase.h:70,

from C:/wxDev-C++/bin/../lib/gcc/mingw32/3.4.2/../../../../include/bits/char_traits.h:46,
from C:/wxDev-C++/bin/../lib/gcc/mingw32/3.4.2/../../../../include/string:47,
from C:/wxDev-C++/bin/../lib/gcc/mingw32/3.4.2/../../../../include/wx/string.h:170,
from C:/wxDev-C++/bin/../lib/gcc/mingw32/3.4.2/../../../../include/wx/memory.h:16,
from C:/wxDev-C++/bin/../lib/gcc/mingw32/3.4.2/../../../../include/wx/object.h:21,
from C:/wxDev-C++/bin/../lib/gcc/mingw32/3.4.2/../../../../include/wx/wx.h:16,
from Project1App.h:18,
from Project1App.cpp:10:
C:/wxDev-C++/bin/../lib/gcc/mingw32/3.4.2/../../../../include/cwchar:65: error: conflicting declaration 'typedef struct mbstate_t mbstate_t'
C:/wxDev-C++/bin/../lib/gcc/mingw32/3.4.2/../../../../include/wchar.h:266: error: 'mbstate_t' has a previous declaration as `typedef int mbstate_t'
C:/wxDev-C++/bin/../lib/gcc/mingw32/3.4.2/../../../../include/cwchar:65: error: declaration of `typedef struct mbstate_t mbstate_t'
C:/wxDev-C++/bin/../lib/gcc/mingw32/3.4.2/../../../../include/wchar.h:266: error: conflicts with previous declaration `typedef int mbstate_t'
C:/wxDev-C++/bin/../lib/gcc/mingw32/3.4.2/../../../../include/cwchar:65: error: declaration of `typedef struct mbstate_t mbstate_t'
C:/wxDev-C++/bin/../lib/gcc/mingw32/3.4.2/../../../../include/wchar.h:266: error: conflicts with previous declaration `typedef int mbstate_t'
C:/wxDev-C++/bin/../lib/gcc/mingw32/3.4.2/../../../../include/cwchar:65: error: declaration of `typedef struct mbstate_t mbstate_t'
C:/wxDev-C++/bin/../lib/gcc/mingw32/3.4.2/../../../../include/wchar.h:266: error: conflicts with previous declaration `typedef int mbstate_t'

In file included from C:/wxDev-C++/bin/../lib/gcc/mingw32/3.4.2/../../../../include/memory:55,

from C:/wxDev-C++/bin/../lib/gcc/mingw32/3.4.2/../../../../include/string:48,

from C:/wxDev-C++/bin/../lib/gcc/mingw32/3.4.2/../../../../include/wx/string.h:170,
from C:/wxDev-C++/bin/../lib/gcc/mingw32/3.4.2/../../../../include/wx/memory.h:16,
from C:/wxDev-C++/bin/../lib/gcc/mingw32/3.4.2/../../../../include/wx/object.h:21,

from C:/wxDev-C++/bin/../lib/gcc/mingw32/3.4.2/../../../../include/wx/wx.h:16,
from Project1App.h:18,
from Project1App.cpp:10:
C:/wxDev-C++/bin/../lib/gcc/mingw32/3.4.2/../../../../include/bits/allocator.h:52:31: bits/c++allocator.h: No such file or directory
In file included from C:/wxDev-C++/bin/../lib/gcc/mingw32/3.4.2/../../../../include/memory:55,
from C:/wxDev-C++/bin/../lib/gcc/mingw32/3.4.2/../../../../include/string:48,
from C:/wxDev-C++/bin/../lib/gcc/mingw32/3.4.2/../../../../include/wx/string.h:170,
from C:/wxDev-C++/bin/../lib/gcc/mingw32/3.4.2/../../../../include/wx/memory.h:16,
from C:/wxDev-C++/bin/../lib/gcc/mingw32/3.4.2/../../../../include/wx/object.h:21,
from C:/wxDev-C++/bin/../lib/gcc/mingw32/3.4.2/../../../../include/wx/wx.h:16,
from Project1App.h:18,
from Project1App.cpp:10:

C:/wxDev-C++/bin/../lib/gcc/mingw32/3.4.2/../../../../include/bits/allocator.h:80: error: expected template-name before '<' token
C:/wxDev-C++/bin/../lib/gcc/mingw32/3.4.2/../../../../include/bits/allocator.h:80: error: expected `{' before '<' token
C:/wxDev-C++/bin/../lib/gcc/mingw32/3.4.2/../../../../include/bits/allocator.h:80: error: expected unqualified-id before '<' token

C:/wxDev-C++/bin/../lib/gcc/mingw32/3.4.2/../../../../include/bits/allocator.h:80: error: expected `;' before '<' token

In file included from C:/wxDev-C++/bin/../lib/gcc/mingw32/3.4.2/../../../../include/bits/basic_string.h:45,
from C:/wxDev-C++/bin/../lib/gcc/mingw32/3.4.2/../../../../include/string:53,
from C:/wxDev-C++/bin/../lib/gcc/mingw32/3.4.2/../../../../include/wx/string.h:170,
from C:/wxDev-C++/bin/../lib/gcc/mingw32/3.4.2/../../../../include/wx/memory.h:16,
from C:/wxDev-C++/bin/../lib/gcc/mingw32/3.4.2/../../../../include/wx/object.h:21,
from C:/wxDev-C++/bin/../lib/gcc/mingw32/3.4.2/../../../../include/wx/wx.h:16,
from Project1App.h:18,
from Project1App.cpp:10:
C:/wxDev-C++/bin/../lib/gcc/mingw32/3.4.2/../../../../include/bits/atomicity.h:33:30: bits/atomic_word.h: No such file or directory
In file included from C:/wxDev-C++/bin/../lib/gcc/mingw32/3.4.2/../../../../include/bits/basic_string.h:45,
from C:/wxDev-C++/bin/../lib/gcc/mingw32/3.4.2/../../../../include/string:53,
from C:/wxDev-C++/bin/../lib/gcc/mingw32/3.4.2/../../../../include/wx/string.h:170,
from C:/wxDev-C++/bin/../lib/gcc/mingw32/3.4.2/../../../../include/wx/memory.h:16,
from C:/wxDev-C++/bin/../lib/gcc/mingw32/3.4.2/../../../../include/wx/object.h:21,
from C:/wxDev-C++/bin/../lib/gcc/mingw32/3.4.2/../../../../include/wx/wx.h:16,
from Project1App.h:18,
from Project1App.cpp:10:
C:/wxDev-C++/bin/../lib/gcc/mingw32/3.4.2/../../../../include/bits/atomicity.h:39: error: expected constructor, destructor, or type conversion before "__exchange_and_add"
C:/wxDev-C++/bin/../lib/gcc/mingw32/3.4.2/../../../../include/bits/atomicity.h:39: error: expected `,' or `;' before "__exchange_and_add"

C:/wxDev-C++/bin/../lib/gcc/mingw32/3.4.2/../../../../include/bits/atomicity.h:43: error: expected `,' or `...' before '*' token
In file included from C:/wxDev-C++/bin/../lib/gcc/mingw32/3.4.2/../../../../include/string:53,
from C:/wxDev-C++/bin/../lib/gcc/mingw32/3.4.2/../../../../include/wx/string.h:170,
from C:/wxDev-C++/bin/../lib/gcc/mingw32/3.4.2/../../../../include/wx/memory.h:16,
from C:/wxDev-C++/bin/../lib/gcc/mingw32/3.4.2/../../../../include/wx/object.h:21,
from C:/wxDev-C++/bin/../lib/gcc/mingw32/3.4.2/../../../../include/wx/wx.h:16,
from Project1App.h:18,
from Project1App.cpp:10:
C:/wxDev-C++/bin/../lib/gcc/mingw32/3.4.2/../../../../include/bits/basic_string.h:148: error: `_Atomic_word' does not name a type

C:/wxDev-C++/bin/../lib/gcc/mingw32/3.4.2/../../../../include/bits/basic_string.h: In member function `void std::basic_string<_CharT, _Traits, _Alloc>::_Rep::_M_dispose(const _Alloc&)':
C:/wxDev-C++/bin/../lib/gcc/mingw32/3.4.2/../../../../include/bits/basic_string.h:215: error: `__exchange_and_add' is not a member of `__gnu_cxx'

C:/wxDev-C++/bin/../lib/gcc/mingw32/3.4.2/../../../../include/bits/basic_string.h: In member function `typename _Alloc::size_type std::basic_string<_CharT, _Traits, _Alloc>::_M_check(typename _Alloc::size_type, const char*) const':
C:/wxDev-C++/bin/../lib/gcc/mingw32/3.4.2/../../../../include/bits/basic_string.h:286: error: there are no arguments to `__N' that depend on a template parameter, so a declaration of `__N' must be available
C:/wxDev-C++/bin/../lib/gcc/mingw32/3.4.2/../../../../include/bits/basic_string.h:286: error: (if you use `-fpermissive', G++ will accept your code, but allowing the use of an undeclared name is deprecated)

C:/wxDev-C++/bin/../lib/gcc/mingw32/3.4.2/../../../../include/bits/basic_string.h: In member function `typename _Alloc::const_reference std::basic_string<_CharT, _Traits, _Alloc>::at(typename _Alloc::size_type) const':
C:/wxDev-C++/bin/../lib/gcc/mingw32/3.4.2/../../../../include/bits/basic_string.h:658: error: there are no arguments to `__N' that depend on a template parameter, so a declaration of `__N' must be available
C:/wxDev-C++/bin/../lib/gcc/mingw32/3.4.2/../../../../include/bits/basic_string.h: In member function `typename _Alloc::reference std::basic_string<_CharT, _Traits, _Alloc>::at(typename _Alloc::size_type)':
C:/wxDev-C++/bin/../lib/gcc/mingw32/3.4.2/../../../../include/bits/basic_string.h:677: error: there are no arguments to `__N' that depend on a template parameter, so a declaration of `__N' must be available

C:/wxDev-C++/bin/../lib/gcc/mingw32/3.4.2/../../../../include/bits/basic_string.h: In member function `std::basic_string<_CharT, _Traits, _Alloc>& std::basic_string<_CharT, _Traits, _Alloc>::_M_replace_aux(typename _Alloc::size_type, typename _Alloc::size_type, typename _Alloc::size_type, _CharT)':
C:/wxDev-C++/bin/../lib/gcc/mingw32/3.4.2/../../../../include/bits/basic_string.h:1355: error: there are no arguments to `__N' that depend on a template parameter, so a declaration of `__N' must be available

In file included from C:/wxDev-C++/bin/../lib/gcc/mingw32/3.4.2/../../../../include/string:57,

from C:/wxDev-C++/bin/../lib/gcc/mingw32/3.4.2/../../../../include/wx/string.h:170,
from C:/wxDev-C++/bin/../lib/gcc/mingw32/3.4.2/../../../../include/wx/memory.h:16,
from C:/wxDev-C++/bin/../lib/gcc/mingw32/3.4.2/../../../../include/wx/object.h:21,

from C:/wxDev-C++/bin/../lib/gcc/mingw32/3.4.2/../../../../include/wx/wx.h:16,
from Project1App.h:18,
from Project1App.cpp:10:
C:/wxDev-C++/bin/../lib/gcc/mingw32/3.4.2/../../../../include/bits/basic_string.tcc: In static member function `static _CharT* std::basic_string<_CharT, _Traits, _Alloc>::_S_construct(_InIterator, _InIterator, const _Alloc&, std::forward_iterator_tag)':
C:/wxDev-C++/bin/../lib/gcc/mingw32/3.4.2/../../../../include/bits/basic_string.tcc:142: error: there are no arguments to `__N' that depend on a template parameter, so a declaration of `__N' must be available

C:/wxDev-C++/bin/../lib/gcc/mingw32/3.4.2/../../../../include/bits/basic_string.tcc: In member function `std::basic_string<_CharT, _Traits, _Alloc>& std::basic_string<_CharT, _Traits, _Alloc>::assign(const _CharT*, typename _Alloc::size_type)':
C:/wxDev-C++/bin/../lib/gcc/mingw32/3.4.2/../../../../include/bits/basic_string.tcc:265: error: there are no arguments to `__N' that depend on a template parameter, so a declaration of `__N' must be available
C:/wxDev-C++/bin/../lib/gcc/mingw32/3.4.2/../../../../include/bits/basic_string.tcc: In member function `std::basic_string<_CharT, _Traits, _Alloc>& std::basic_string<_CharT, _Traits, _Alloc>::insert(typename _Alloc::size_type, const _CharT*, typename _Alloc::size_type)':
C:/wxDev-C++/bin/../lib/gcc/mingw32/3.4.2/../../../../include/bits/basic_string.tcc:292: error: there are no arguments to `__N' that depend on a template parameter, so a declaration of `__N' must be available
C:/wxDev-C++/bin/../lib/gcc/mingw32/3.4.2/../../../../include/bits/basic_string.tcc: In member function `std::basic_string<_CharT, _Traits, _Alloc>& std::basic_string<_CharT, _Traits, _Alloc>::replace(typename _Alloc::size_type, typename _Alloc::size_type, const _CharT*, typename _Alloc::size_type)':
C:/wxDev-C++/bin/../lib/gcc/mingw32/3.4.2/../../../../include/bits/basic_string.tcc:329: error: there are no arguments to `__N' that depend on a template parameter, so a declaration of `__N' must be available

C:/wxDev-C++/bin/../lib/gcc/mingw32/3.4.2/../../../../include/bits/basic_string.tcc: In member function `void std::basic_string<_CharT, _Traits, _Alloc>::reserve(typename _Alloc::size_type)':
C:/wxDev-C++/bin/../lib/gcc/mingw32/3.4.2/../../../../include/bits/basic_string.tcc:423: error: there are no arguments to `__N' that depend on a template parameter, so a declaration of `__N' must be available
C:/wxDev-C++/bin/../lib/gcc/mingw32/3.4.2/../../../../include/bits/basic_string.tcc: In static member function `static typename std::basic_string<_CharT, _Traits, _Alloc>::_Rep* std::basic_string<_CharT, _Traits, _Alloc>::_Rep::_S_create(typename _Alloc::size_type, typename _Alloc::size_type, const _Alloc&)':
C:/wxDev-C++/bin/../lib/gcc/mingw32/3.4.2/../../../../include/bits/basic_string.tcc:469: error: there are no arguments to `__N' that depend on a template parameter, so a declaration of `__N' must be available

C:/wxDev-C++/bin/../lib/gcc/mingw32/3.4.2/../../../../include/bits/basic_string.tcc: In member function `void std::basic_string<_CharT, _Traits, _Alloc>::resize(typename _Alloc::size_type, _CharT)':
C:/wxDev-C++/bin/../lib/gcc/mingw32/3.4.2/../../../../include/bits/basic_string.tcc:569: error: there are no arguments to `__N' that depend on a template parameter, so a declaration of `__N' must be available
C:/wxDev-C++/bin/../lib/gcc/mingw32/3.4.2/../../../../include/bits/basic_string.tcc: In member function `std::basic_string<_CharT, _Traits, _Alloc>& std::basic_string<_CharT, _Traits, _Alloc>::_M_replace_dispatch(__gnu_cxx::__normal_iterator<typename _Alloc::pointer, std::basic_string<_CharT, _Traits, _Alloc> >, __gnu_cxx::__normal_iterator<typename _Alloc::pointer, std::basic_string<_CharT, _Traits, _Alloc> >, _InputIterator, _InputIterator, __false_type)':
C:/wxDev-C++/bin/../lib/gcc/mingw32/3.4.2/../../../../include/bits/basic_string.tcc:588: error: there are no arguments to `__N' that depend on a template parameter, so a declaration of `__N' must be available

In file included from C:/wxDev-C++/bin/../lib/gcc/mingw32/3.4.2/../../../../include/wx/memory.h:16,
from C:/wxDev-C++/bin/../lib/gcc/mingw32/3.4.2/../../../../include/wx/object.h:21,
from C:/wxDev-C++/bin/../lib/gcc/mingw32/3.4.2/../../../../include/wx/wx.h:16,
from Project1App.h:18,
from Project1App.cpp:10:
C:/wxDev-C++/bin/../lib/gcc/mingw32/3.4.2/../../../../include/wx/string.h: At global scope:
C:/wxDev-C++/bin/../lib/gcc/mingw32/3.4.2/../../../../include/wx/string.h:175: error: expected init-declarator before "wxStdString"
C:/wxDev-C++/bin/../lib/gcc/mingw32/3.4.2/../../../../include/wx/string.h:175: error: expected `,' or `;' before "wxStdString"
C:/wxDev-C++/bin/../lib/gcc/mingw32/3.4.2/../../../../include/wx/string.h:197: error: `wxStdString' does not name a type

C:/wxDev-C++/bin/../lib/gcc/mingw32/3.4.2/../../../../include/wx/string.h:654: error: expected class-name before '{' token
C:/wxDev-C++/bin/../lib/gcc/mingw32/3.4.2/../../../../include/wx/string.h:683: error: expected `,' or `...' before '&' token
C:/wxDev-C++/bin/../lib/gcc/mingw32/3.4.2/../../../../include/wx/string.h:683: error: `wxString::wxString(int)' and `wxString::wxString(int)' cannot be overloaded
C:/wxDev-C++/bin/../lib/gcc/mingw32/3.4.2/../../../../include/wx/string.h:822: error: declaration of `operator[]' as non-function
C:/wxDev-C++/bin/../lib/gcc/mingw32/3.4.2/../../../../include/wx/string.h:822: error: expected `;' before '(' token
C:/wxDev-C++/bin/../lib/gcc/mingw32/3.4.2/../../../../include/wx/string.h:830: error: expected `;' before "inline"

C:/wxDev-C++/bin/../lib/gcc/mingw32/3.4.2/../../../../include/wx/string.h:896: error: expected `,' or `...' before '&' token
C:/wxDev-C++/bin/../lib/gcc/mingw32/3.4.2/../../../../include/wx/string.h:897: error: `wxString& wxString::operator=(int)' and `wxString& wxString::operator=(int)' cannot be overloaded

C:/wxDev-C++/bin/../lib/gcc/mingw32/3.4.2/../../../../include/wx/string.h:1253: error: expected `)' before "first"

C:/wxDev-C++/bin/../lib/gcc/mingw32/3.4.2/../../../../include/wx/string.h:1273: error: `append' declared as an `inline' field
C:/wxDev-C++/bin/../lib/gcc/mingw32/3.4.2/../../../../include/wx/string.h:1273: error: expected `;' before '(' token
C:/wxDev-C++/bin/../lib/gcc/mingw32/3.4.2/../../../../include/wx/string.h:1277: error: expected `;' before "inline"
C:/wxDev-C++/bin/../lib/gcc/mingw32/3.4.2/../../../../include/wx/string.h:1291: error: `assign' declared as an `inline' field
C:/wxDev-C++/bin/../lib/gcc/mingw32/3.4.2/../../../../include/wx/string.h:1291: error: expected `;' before '(' token
C:/wxDev-C++/bin/../lib/gcc/mingw32/3.4.2/../../../../include/wx/string.h:1310: error: expected `;' before "inline"
C:/wxDev-C++/bin/../lib/gcc/mingw32/3.4.2/../../../../include/wx/string.h:1323: error: `iterator' does not name a type
C:/wxDev-C++/bin/../lib/gcc/mingw32/3.4.2/../../../../include/wx/string.h:1325: error: variable or field `insert' declared void
C:/wxDev-C++/bin/../lib/gcc/mingw32/3.4.2/../../../../include/wx/string.h:1325: error: `insert' declared as an `inline' field
C:/wxDev-C++/bin/../lib/gcc/mingw32/3.4.2/../../../../include/wx/string.h:1325: error: expected `;' before '(' token
C:/wxDev-C++/bin/../lib/gcc/mingw32/3.4.2/../../../../include/wx/string.h:1327: error: expected `;' before "inline"
C:/wxDev-C++/bin/../lib/gcc/mingw32/3.4.2/../../../../include/wx/string.h:1327: error: variable or field `insert' declared void
C:/wxDev-C++/bin/../lib/gcc/mingw32/3.4.2/../../../../include/wx/string.h:1327: error: `insert' declared as an `inline' field
C:/wxDev-C++/bin/../lib/gcc/mingw32/3.4.2/../../../../include/wx/string.h:1327: error: expected `;' before '(' token
C:/wxDev-C++/bin/../lib/gcc/mingw32/3.4.2/../../../../include/wx/string.h:1331: error: expected `;' before "inline"
C:/wxDev-C++/bin/../lib/gcc/mingw32/3.4.2/../../../../include/wx/string.h:1331: error: `erase' declared as an `inline' field

C:/wxDev-C++/bin/../lib/gcc/mingw32/3.4.2/../../../../include/wx/string.h:1331: error: expected `;' before '(' token
C:/wxDev-C++/bin/../lib/gcc/mingw32/3.4.2/../../../../include/wx/string.h:1333: error: expected `;' before "inline"
C:/wxDev-C++/bin/../lib/gcc/mingw32/3.4.2/../../../../include/wx/string.h:1333: error: `iterator' does not name a type
C:/wxDev-C++/bin/../lib/gcc/mingw32/3.4.2/../../../../include/wx/string.h:1335: error: `iterator' does not name a type
C:/wxDev-C++/bin/../lib/gcc/mingw32/3.4.2/../../../../include/wx/string.h:1360: error: `replace' declared as an `inline' field
C:/wxDev-C++/bin/../lib/gcc/mingw32/3.4.2/../../../../include/wx/string.h:1360: error: expected `;' before '(' token
C:/wxDev-C++/bin/../lib/gcc/mingw32/3.4.2/../../../../include/wx/string.h:1362: error: expected `;' before "inline"
C:/wxDev-C++/bin/../lib/gcc/mingw32/3.4.2/../../../../include/wx/string.h:1362: error: `replace' declared as an `inline' field
C:/wxDev-C++/bin/../lib/gcc/mingw32/3.4.2/../../../../include/wx/string.h:1362: error: expected `;' before '(' token
C:/wxDev-C++/bin/../lib/gcc/mingw32/3.4.2/../../../../include/wx/string.h:1365: error: expected `;' before "inline"
C:/wxDev-C++/bin/../lib/gcc/mingw32/3.4.2/../../../../include/wx/string.h:1365: error: `replace' declared as an `inline' field
C:/wxDev-C++/bin/../lib/gcc/mingw32/3.4.2/../../../../include/wx/string.h:1365: error: expected `;' before '(' token
C:/wxDev-C++/bin/../lib/gcc/mingw32/3.4.2/../../../../include/wx/string.h:1367: error: expected `;' before "inline"
C:/wxDev-C++/bin/../lib/gcc/mingw32/3.4.2/../../../../include/wx/string.h:1367: error: `replace' declared as an `inline' field
C:/wxDev-C++/bin/../lib/gcc/mingw32/3.4.2/../../../../include/wx/string.h:1367: error: expected `;' before '(' token
C:/wxDev-C++/bin/../lib/gcc/mingw32/3.4.2/../../../../include/wx/string.h:1369: error: expected `;' before "inline"
C:/wxDev-C++/bin/../lib/gcc/mingw32/3.4.2/../../../../include/wx/string.h:1369: error: `replace' declared as an `inline' field
C:/wxDev-C++/bin/../lib/gcc/mingw32/3.4.2/../../../../include/wx/string.h:1369: error: expected `;' before '(' token
C:/wxDev-C++/bin/../lib/gcc/mingw32/3.4.2/../../../../include/wx/string.h:1374: error: expected `;' before "inline"
C:/wxDev-C++/bin/../lib/gcc/mingw32/3.4.2/../../../../include/wx/string.h:698: error: `npos' was not declared in this scope
C:/wxDev-C++/bin/../lib/gcc/mingw32/3.4.2/../../../../include/wx/string.h:716: error: `npos' was not declared in this scope
C:/wxDev-C++/bin/../lib/gcc/mingw32/3.4.2/../../../../include/wx/string.h:1063: error: `npos' was not declared in this scope
C:/wxDev-C++/bin/../lib/gcc/mingw32/3.4.2/../../../../include/wx/string.h: In constructor `wxString::wxString()':
C:/wxDev-C++/bin/../lib/gcc/mingw32/3.4.2/../../../../include/wx/string.h:681: error: class `wxString' does not have any field named `wxStringBase'
C:/wxDev-C++/bin/../lib/gcc/mingw32/3.4.2/../../../../include/wx/string.h: In constructor `wxString::wxString(int)':
C:/wxDev-C++/bin/../lib/gcc/mingw32/3.4.2/../../../../include/wx/string.h:683: error: class `wxString' does not have any field named `wxStringBase'
C:/wxDev-C++/bin/../lib/gcc/mingw32/3.4.2/../../../../include/wx/string.h:683: error: `stringSrc' undeclared (first use this function)
C:/wxDev-C++/bin/../lib/gcc/mingw32/3.4.2/../../../../include/wx/string.h:683: error: (Each undeclared identifier is reported only once for each function it appears in.)

C:/wxDev-C++/bin/../lib/gcc/mingw32/3.4.2/../../../../include/wx/string.h: In copy constructor `wxString::wxString(const wxString&)':
C:/wxDev-C++/bin/../lib/gcc/mingw32/3.4.2/../../../../include/wx/string.h:684: error: class `wxString' does not have any field named `wxStringBase'
C:/wxDev-C++/bin/../lib/gcc/mingw32/3.4.2/../../../../include/wx/string.h: In constructor `wxString::wxString(wxChar, size_t)':
C:/wxDev-C++/bin/../lib/gcc/mingw32/3.4.2/../../../../include/wx/string.h:687: error: class `wxString' does not have any field named `wxStringBase'
C:/wxDev-C++/bin/../lib/gcc/mingw32/3.4.2/../../../../include/wx/string.h: In constructor `wxString::wxString(size_t, wxChar)':
C:/wxDev-C++/bin/../lib/gcc/mingw32/3.4.2/../../../../include/wx/string.h:689: error: class `wxString' does not have any field named `wxStringBase'
C:/wxDev-C++/bin/../lib/gcc/mingw32/3.4.2/../../../../include/wx/string.h: In constructor `wxString::wxString(const wxChar*)':
C:/wxDev-C++/bin/../lib/gcc/mingw32/3.4.2/../../../../include/wx/string.h:693: error: class `wxString' does not have any field named `wxStringBase'
C:/wxDev-C++/bin/../lib/gcc/mingw32/3.4.2/../../../../include/wx/string.h: In constructor `wxString::wxString(const wxChar*, size_t)':
C:/wxDev-C++/bin/../lib/gcc/mingw32/3.4.2/../../../../include/wx/string.h:695: error: class `wxString' does not have any field named `wxStringBase'
C:/wxDev-C++/bin/../lib/gcc/mingw32/3.4.2/../../../../include/wx/string.h: In constructor `wxString::wxString(const wxChar*, const wxMBConv&, size_t)':
C:/wxDev-C++/bin/../lib/gcc/mingw32/3.4.2/../../../../include/wx/string.h:699: error: class `wxString' does not have any field named `wxStringBase'
C:/wxDev-C++/bin/../lib/gcc/mingw32/3.4.2/../../../../include/wx/string.h:699: error: `npos' undeclared (first use this function)
C:/wxDev-C++/bin/../lib/gcc/mingw32/3.4.2/../../../../include/wx/string.h: In constructor `wxString::wxString(const wxWCharBuffer&)':
C:/wxDev-C++/bin/../lib/gcc/mingw32/3.4.2/../../../../include/wx/string.h:718: error: class `wxString' does not have any field named `wxStringBase'
C:/wxDev-C++/bin/../lib/gcc/mingw32/3.4.2/../../../../include/wx/string.h: In constructor `wxString::wxString(char)':
C:/wxDev-C++/bin/../lib/gcc/mingw32/3.4.2/../../../../include/wx/string.h:720: error: class `wxString' does not have any field named `wxStringBase'
C:/wxDev-C++/bin/../lib/gcc/mingw32/3.4.2/../../../../include/wx/string.h: In member function `size_t wxString::Len() const':
C:/wxDev-C++/bin/../lib/gcc/mingw32/3.4.2/../../../../include/wx/string.h:743: error: `length' undeclared (first use this function)
C:/wxDev-C++/bin/../lib/gcc/mingw32/3.4.2/../../../../include/wx/string.h: In member function `bool wxString::IsEmpty() const':
C:/wxDev-C++/bin/../lib/gcc/mingw32/3.4.2/../../../../include/wx/string.h:745: error: `empty' undeclared (first use this function)
C:/wxDev-C++/bin/../lib/gcc/mingw32/3.4.2/../../../../include/wx/string.h: In member function `bool wxString::operator!() const':
C:/wxDev-C++/bin/../lib/gcc/mingw32/3.4.2/../../../../include/wx/string.h:747: error: `empty' undeclared (first use this function)
C:/wxDev-C++/bin/../lib/gcc/mingw32/3.4.2/../../../../include/wx/string.h: In member function `void wxString::Clear()':
C:/wxDev-C++/bin/../lib/gcc/mingw32/3.4.2/../../../../include/wx/string.h:761: error: `swap' undeclared (first use this function)
C:/wxDev-C++/bin/../lib/gcc/mingw32/3.4.2/../../../../include/wx/string.h: In member function `wxChar wxString::GetChar(size_t) const':
C:/wxDev-C++/bin/../lib/gcc/mingw32/3.4.2/../../../../include/wx/string.h:775: error: `at' undeclared (first use this function)
C:/wxDev-C++/bin/../lib/gcc/mingw32/3.4.2/../../../../include/wx/string.h: In member function `wxChar& wxString::GetWritableChar(size_t)':
C:/wxDev-C++/bin/../lib/gcc/mingw32/3.4.2/../../../../include/wx/string.h:778: error: `at' undeclared (first use this function)
C:/wxDev-C++/bin/../lib/gcc/mingw32/3.4.2/../../../../include/wx/string.h: In member function `void wxString::SetChar(size_t, wxChar)':
C:/wxDev-C++/bin/../lib/gcc/mingw32/3.4.2/../../../../include/wx/string.h:781: error: `at' undeclared (first use this function)

C:/wxDev-C++/bin/../lib/gcc/mingw32/3.4.2/../../../../include/wx/string.h: In member function `wxChar wxString::Last() const':

C:/wxDev-C++/bin/../lib/gcc/mingw32/3.4.2/../../../../include/wx/string.h:788: error: `length' undeclared (first use this function)
C:/wxDev-C++/bin/../lib/gcc/mingw32/3.4.2/../../../../include/wx/string.h:788: error: `at' undeclared (first use this function)
C:/wxDev-C++/bin/../lib/gcc/mingw32/3.4.2/../../../../include/wx/string.h: In member function `wxChar& wxString::Last()':
C:/wxDev-C++/bin/../lib/gcc/mingw32/3.4.2/../../../../include/wx/string.h:795: error: `length' undeclared (first use this function)
C:/wxDev-C++/bin/../lib/gcc/mingw32/3.4.2/../../../../include/wx/string.h:795: error: `at' undeclared (first use this function)
C:/wxDev-C++/bin/../lib/gcc/mingw32/3.4.2/../../../../include/wx/string.h: In member function `wxChar& wxString::operator[](int)':
C:/wxDev-C++/bin/../lib/gcc/mingw32/3.4.2/../../../../include/wx/string.h:821: error: `wxStringBase' has not been declared
C:/wxDev-C++/bin/../lib/gcc/mingw32/3.4.2/../../../../include/wx/string.h:821: error: `at' undeclared (first use this function)
C:/wxDev-C++/bin/../lib/gcc/mingw32/3.4.2/../../../../include/wx/string.h: In member function `wxString::operator const wxChar*() const':
C:/wxDev-C++/bin/../lib/gcc/mingw32/3.4.2/../../../../include/wx/string.h:830: error: `c_str' undeclared (first use this function)
C:/wxDev-C++/bin/../lib/gcc/mingw32/3.4.2/../../../../include/wx/string.h: In member function `const wxChar* wxString::wx_str() const':

C:/wxDev-C++/bin/../lib/gcc/mingw32/3.4.2/../../../../include/wx/string.h:833: error: `c_str' undeclared (first use this function)
C:/wxDev-C++/bin/../lib/gcc/mingw32/3.4.2/../../../../include/wx/string.h: In member function `const wxChar* wxString::GetData() const':
C:/wxDev-C++/bin/../lib/gcc/mingw32/3.4.2/../../../../include/wx/string.h:835: error: `c_str' undeclared (first use this function)
C:/wxDev-C++/bin/../lib/gcc/mingw32/3.4.2/../../../../include/wx/string.h: In member function `const wxChar* wxString::wc_str() const':
C:/wxDev-C++/bin/../lib/gcc/mingw32/3.4.2/../../../../include/wx/string.h:867: error: `c_str' undeclared (first use this function)
C:/wxDev-C++/bin/../lib/gcc/mingw32/3.4.2/../../../../include/wx/string.h: In member function `const wxChar* wxString::wc_str(const wxMBConv&) const':
C:/wxDev-C++/bin/../lib/gcc/mingw32/3.4.2/../../../../include/wx/string.h:870: error: `c_str' undeclared (first use this function)
C:/wxDev-C++/bin/../lib/gcc/mingw32/3.4.2/../../../../include/wx/string.h: In member function `const wxChar* wxString::fn_str() const':
C:/wxDev-C++/bin/../lib/gcc/mingw32/3.4.2/../../../../include/wx/string.h:875: error: `c_str' undeclared (first use this function)
C:/wxDev-C++/bin/../lib/gcc/mingw32/3.4.2/../../../../include/wx/string.h: In member function `wxString& wxString::operator=(int)':
C:/wxDev-C++/bin/../lib/gcc/mingw32/3.4.2/../../../../include/wx/string.h:897: error: `clear' undeclared (first use this function)
C:/wxDev-C++/bin/../lib/gcc/mingw32/3.4.2/../../../../include/wx/string.h:897: error: `wxStringBase' is not a class or namespace
C:/wxDev-C++/bin/../lib/gcc/mingw32/3.4.2/../../../../include/wx/string.h:897: error: `stringSrc' undeclared (first use this function)
C:/wxDev-C++/bin/../lib/gcc/mingw32/3.4.2/../../../../include/wx/string.h: In member function `wxString& wxString::operator=(wxChar)':
C:/wxDev-C++/bin/../lib/gcc/mingw32/3.4.2/../../../../include/wx/string.h:900: error: `clear' undeclared (first use this function)
C:/wxDev-C++/bin/../lib/gcc/mingw32/3.4.2/../../../../include/wx/string.h:900: error: `wxStringBase' has not been declared
C:/wxDev-C++/bin/../lib/gcc/mingw32/3.4.2/../../../../include/wx/string.h: In member function `wxString& wxString::operator=(const wxChar*)':
C:/wxDev-C++/bin/../lib/gcc/mingw32/3.4.2/../../../../include/wx/string.h:905: error: `clear' undeclared (first use this function)
C:/wxDev-C++/bin/../lib/gcc/mingw32/3.4.2/../../../../include/wx/string.h:905: error: `wxStringBase' has not been declared
C:/wxDev-C++/bin/../lib/gcc/mingw32/3.4.2/../../../../include/wx/string.h: In member function `wxString& wxString::operator=(const char*)':
C:/wxDev-C++/bin/../lib/gcc/mingw32/3.4.2/../../../../include/wx/string.h:914: error: `clear' undeclared (first use this function)
C:/wxDev-C++/bin/../lib/gcc/mingw32/3.4.2/../../../../include/wx/string.h:914: error: `wxStringBase' has not been declared
C:/wxDev-C++/bin/../lib/gcc/mingw32/3.4.2/../../../../include/wx/string.h:914: error: 'class wxString' has no member named 'c_str'
C:/wxDev-C++/bin/../lib/gcc/mingw32/3.4.2/../../../../include/wx/string.h: In member function `wxString& wxString::operator=(const wxWCharBuffer&)':
C:/wxDev-C++/bin/../lib/gcc/mingw32/3.4.2/../../../../include/wx/string.h:921: error: `clear' undeclared (first use this function)
C:/wxDev-C++/bin/../lib/gcc/mingw32/3.4.2/../../../../include/wx/string.h: In member function `wxString& wxString::Append(const wxString&)':
C:/wxDev-C++/bin/../lib/gcc/mingw32/3.4.2/../../../../include/wx/string.h:975: error: `empty' undeclared (first use this function)
C:/wxDev-C++/bin/../lib/gcc/mingw32/3.4.2/../../../../include/wx/string.h: In member function `bool wxString::IsSameAs(wxChar, bool) const':
C:/wxDev-C++/bin/../lib/gcc/mingw32/3.4.2/../../../../include/wx/string.h:1056: error: `length' undeclared (first use this function)
C:/wxDev-C++/bin/../lib/gcc/mingw32/3.4.2/../../../../include/wx/string.h: In member function `size_t wxString::find(const char*, size_t) const':
C:/wxDev-C++/bin/../lib/gcc/mingw32/3.4.2/../../../../include/wx/string.h:1131: error: `wxStringBase' has not been declared
C:/wxDev-C++/bin/../lib/gcc/mingw32/3.4.2/../../../../include/wx/string.h:1131: error: 'class wxString' has no member named 'c_str'
C:/wxDev-C++/bin/../lib/gcc/mingw32/3.4.2/../../../../include/wx/string.h: In member function `size_t wxString::find(const wchar_t*, size_t) const':
C:/wxDev-C++/bin/../lib/gcc/mingw32/3.4.2/../../../../include/wx/string.h:1133: error: `wxStringBase' has not been declared
C:/wxDev-C++/bin/../lib/gcc/mingw32/3.4.2/../../../../include/wx/string.h: In member function `size_t wxString::find(char, size_t) const':
C:/wxDev-C++/bin/../lib/gcc/mingw32/3.4.2/../../../../include/wx/string.h:1135: error: `wxStringBase' has not been declared
C:/wxDev-C++/bin/../lib/gcc/mingw32/3.4.2/../../../../include/wx/string.h: In member function `size_t wxString::find(wchar_t, size_t) const':
C:/wxDev-C++/bin/../lib/gcc/mingw32/3.4.2/../../../../include/wx/string.h:1137: error: `wxStringBase' has not been declared

C:/wxDev-C++/bin/../lib/gcc/mingw32/3.4.2/../../../../include/wx/string.h: In member function `bool wxString::Alloc(size_t)':
C:/wxDev-C++/bin/../lib/gcc/mingw32/3.4.2/../../../../include/wx/string.h:1182: error: `reserve' undeclared (first use this function)
C:/wxDev-C++/bin/../lib/gcc/mingw32/3.4.2/../../../../include/wx/string.h: In member function `size_t wxString::Length() const':
C:/wxDev-C++/bin/../lib/gcc/mingw32/3.4.2/../../../../include/wx/string.h:1214: error: `length' undeclared (first use this function)
C:/wxDev-C++/bin/../lib/gcc/mingw32/3.4.2/../../../../include/wx/string.h: In member function `wxString& wxString::RemoveLast(size_t)':
C:/wxDev-C++/bin/../lib/gcc/mingw32/3.4.2/../../../../include/wx/string.h:1229: error: `length' undeclared (first use this function)
C:/wxDev-C++/bin/../lib/gcc/mingw32/3.4.2/../../../../include/wx/string.h: In member function `wxString& wxString::Remove(size_t, size_t)':
C:/wxDev-C++/bin/../lib/gcc/mingw32/3.4.2/../../../../include/wx/string.h:1232: error: `erase' undeclared (first use this function)
C:/wxDev-C++/bin/../lib/gcc/mingw32/3.4.2/../../../../include/wx/string.h: In member function `int wxString::Last(wxChar) const':
C:/wxDev-C++/bin/../lib/gcc/mingw32/3.4.2/../../../../include/wx/string.h:1238: error: `find_last_of' undeclared (first use this function)
C:/wxDev-C++/bin/../lib/gcc/mingw32/3.4.2/../../../../include/wx/string.h: In member function `bool wxString::IsNull() const':
C:/wxDev-C++/bin/../lib/gcc/mingw32/3.4.2/../../../../include/wx/string.h:1242: error: `empty' undeclared (first use this function)
C:/wxDev-C++/bin/../lib/gcc/mingw32/3.4.2/../../../../include/wx/string.h: In constructor `wxString::wxString(const wxString&, size_t, size_t)':
C:/wxDev-C++/bin/../lib/gcc/mingw32/3.4.2/../../../../include/wx/string.h:1248: error: class `wxString' does not have any field named `wxStringBase'
C:/wxDev-C++/bin/../lib/gcc/mingw32/3.4.2/../../../../include/wx/string.h: In constructor `wxString::wxString(const void*, const void*)':
C:/wxDev-C++/bin/../lib/gcc/mingw32/3.4.2/../../../../include/wx/string.h:1251: error: class `wxString' does not have any field named `wxStringBase'
C:/wxDev-C++/bin/../lib/gcc/mingw32/3.4.2/../../../../include/wx/string.h: In member function `wxString& wxString::append(const wxString&, size_t, size_t)':
C:/wxDev-C++/bin/../lib/gcc/mingw32/3.4.2/../../../../include/wx/string.h:1260: error: `wxStringBase' has not been declared
C:/wxDev-C++/bin/../lib/gcc/mingw32/3.4.2/../../../../include/wx/string.h: In member function `wxString& wxString::append(const wxString&)':
C:/wxDev-C++/bin/../lib/gcc/mingw32/3.4.2/../../../../include/wx/string.h:1263: error: `wxStringBase' has not been declared
C:/wxDev-C++/bin/../lib/gcc/mingw32/3.4.2/../../../../include/wx/string.h: In member function `wxString& wxString::append(const wxChar*)':
C:/wxDev-C++/bin/../lib/gcc/mingw32/3.4.2/../../../../include/wx/string.h:1266: error: `wxStringBase' has not been declared
C:/wxDev-C++/bin/../lib/gcc/mingw32/3.4.2/../../../../include/wx/string.h: In member function `wxString& wxString::append(const wxChar*, size_t)':
C:/wxDev-C++/bin/../lib/gcc/mingw32/3.4.2/../../../../include/wx/string.h:1268: error: `wxStringBase' has not been declared
C:/wxDev-C++/bin/../lib/gcc/mingw32/3.4.2/../../../../include/wx/string.h: In member function `wxString& wxString::append(size_t, wxChar)':
C:/wxDev-C++/bin/../lib/gcc/mingw32/3.4.2/../../../../include/wx/string.h:1271: error: `wxStringBase' has not been declared
C:/wxDev-C++/bin/../lib/gcc/mingw32/3.4.2/../../../../include/wx/string.h: In member function `wxString& wxString::assign(const wxString&)':
C:/wxDev-C++/bin/../lib/gcc/mingw32/3.4.2/../../../../include/wx/string.h:1278: error: `wxStringBase' has not been declared
C:/wxDev-C++/bin/../lib/gcc/mingw32/3.4.2/../../../../include/wx/string.h: In member function `wxString& wxString::assign(const wxString&, size_t, size_t)':
C:/wxDev-C++/bin/../lib/gcc/mingw32/3.4.2/../../../../include/wx/string.h:1281: error: `wxStringBase' has not been declared
C:/wxDev-C++/bin/../lib/gcc/mingw32/3.4.2/../../../../include/wx/string.h: In member function `wxString& wxString::assign(const wxChar*)':
C:/wxDev-C++/bin/../lib/gcc/mingw32/3.4.2/../../../../include/wx/string.h:1284: error: `wxStringBase' has not been declared
C:/wxDev-C++/bin/../lib/gcc/mingw32/3.4.2/../../../../include/wx/string.h: In member function `wxString& wxString::assign(const wxChar*, size_t)':
C:/wxDev-C++/bin/../lib/gcc/mingw32/3.4.2/../../../../include/wx/string.h:1286: error: `wxStringBase' has not been declared
C:/wxDev-C++/bin/../lib/gcc/mingw32/3.4.2/../../../../include/wx/string.h: In member function `wxString& wxString::assign(size_t, wxChar)':
C:/wxDev-C++/bin/../lib/gcc/mingw32/3.4.2/../../../../include/wx/string.h:1289: error: `wxStringBase' has not been declared

C:/wxDev-C++/bin/../lib/gcc/mingw32/3.4.2/../../../../include/wx/string.h: In member function `wxString& wxString::insert(size_t, const wxString&)':
C:/wxDev-C++/bin/../lib/gcc/mingw32/3.4.2/../../../../include/wx/string.h:1311: error: `wxStringBase' has not been declared
C:/wxDev-C++/bin/../lib/gcc/mingw32/3.4.2/../../../../include/wx/string.h: In member function `wxString& wxString::insert(size_t, const wxString&, size_t, size_t)':
C:/wxDev-C++/bin/../lib/gcc/mingw32/3.4.2/../../../../include/wx/string.h:1314: error: `wxStringBase' has not been declared
C:/wxDev-C++/bin/../lib/gcc/mingw32/3.4.2/../../../../include/wx/string.h: In member function `wxString& wxString::insert(size_t, const wxChar*)':
C:/wxDev-C++/bin/../lib/gcc/mingw32/3.4.2/../../../../include/wx/string.h:1317: error: `wxStringBase' has not been declared
C:/wxDev-C++/bin/../lib/gcc/mingw32/3.4.2/../../../../include/wx/string.h: In member function `wxString& wxString::insert(size_t, const wxChar*, size_t)':
C:/wxDev-C++/bin/../lib/gcc/mingw32/3.4.2/../../../../include/wx/string.h:1319: error: `wxStringBase' has not been declared

C:/wxDev-C++/bin/../lib/gcc/mingw32/3.4.2/../../../../include/wx/string.h: In member function `wxString& wxString::insert(size_t, size_t, wxChar)':
C:/wxDev-C++/bin/../lib/gcc/mingw32/3.4.2/../../../../include/wx/string.h:1322: error: `wxStringBase' has not been declared
C:/wxDev-C++/bin/../lib/gcc/mingw32/3.4.2/../../../../include/wx/string.h: In member function `wxString& wxString::replace(size_t, size_t, const wxChar*)':
C:/wxDev-C++/bin/../lib/gcc/mingw32/3.4.2/../../../../include/wx/string.h:1344: error: `wxStringBase' has not been declared
C:/wxDev-C++/bin/../lib/gcc/mingw32/3.4.2/../../../../include/wx/string.h: In member function `wxString& wxString::replace(size_t, size_t, const wxString&)':
C:/wxDev-C++/bin/../lib/gcc/mingw32/3.4.2/../../../../include/wx/string.h:1347: error: `wxStringBase' has not been declared
C:/wxDev-C++/bin/../lib/gcc/mingw32/3.4.2/../../../../include/wx/string.h: In member function `wxString& wxString::replace(size_t, size_t, size_t, wxChar)':
C:/wxDev-C++/bin/../lib/gcc/mingw32/3.4.2/../../../../include/wx/string.h:1350: error: `wxStringBase' has not been declared
C:/wxDev-C++/bin/../lib/gcc/mingw32/3.4.2/../../../../include/wx/string.h: In member function `wxString& wxString::replace(size_t, size_t, const wxString&, size_t, size_t)':
C:/wxDev-C++/bin/../lib/gcc/mingw32/3.4.2/../../../../include/wx/string.h:1354: error: `wxStringBase' has not been declared
C:/wxDev-C++/bin/../lib/gcc/mingw32/3.4.2/../../../../include/wx/string.h: In member function `wxString& wxString::replace(size_t, size_t, const wxChar*, size_t)':
C:/wxDev-C++/bin/../lib/gcc/mingw32/3.4.2/../../../../include/wx/string.h:1359: error: `wxStringBase' has not been declared
C:/wxDev-C++/bin/../lib/gcc/mingw32/3.4.2/../../../../include/wx/string.h: In member function `wxString& wxString::operator+=(const wxString&)':
C:/wxDev-C++/bin/../lib/gcc/mingw32/3.4.2/../../../../include/wx/string.h:1375: error: `wxStringBase' has not been declared

C:/wxDev-C++/bin/../lib/gcc/mingw32/3.4.2/../../../../include/wx/string.h: In member function `wxString& wxString::operator+=(const wxChar*)':

C:/wxDev-C++/bin/../lib/gcc/mingw32/3.4.2/../../../../include/wx/string.h:1378: error: `wxStringBase' has not been declared
C:/wxDev-C++/bin/../lib/gcc/mingw32/3.4.2/../../../../include/wx/string.h: In member function `wxString& wxString::operator+=(wxChar)':
C:/wxDev-C++/bin/../lib/gcc/mingw32/3.4.2/../../../../include/wx/string.h:1381: error: `wxStringBase' has not been declared
C:/wxDev-C++/bin/../lib/gcc/mingw32/3.4.2/../../../../include/wx/string.h: In member function `wxString& wxString::operator+=(const char*)':
C:/wxDev-C++/bin/../lib/gcc/mingw32/3.4.2/../../../../include/wx/string.h:1384: error: `wxStringBase' has not been declared
C:/wxDev-C++/bin/../lib/gcc/mingw32/3.4.2/../../../../include/wx/string.h:1384: error: 'class wxString' has no member named 'c_str'
C:/wxDev-C++/bin/../lib/gcc/mingw32/3.4.2/../../../../include/wx/string.h: In member function `wxString& wxString::operator+=(char)':
C:/wxDev-C++/bin/../lib/gcc/mingw32/3.4.2/../../../../include/wx/string.h:1386: error: `wxStringBase' has not been declared
C:/wxDev-C++/bin/../lib/gcc/mingw32/3.4.2/../../../../include/wx/string.h:1386: error: 'class wxString' has no member named 'c_str'
C:/wxDev-C++/bin/../lib/gcc/mingw32/3.4.2/../../../../include/wx/string.h: In function `bool operator==(const wxString&, const char*)':
C:/wxDev-C++/bin/../lib/gcc/mingw32/3.4.2/../../../../include/wx/string.h:1606: error: 'const class wxString' has no member named 'length'
C:/wxDev-C++/bin/../lib/gcc/mingw32/3.4.2/../../../../include/wx/string.h:1606: error: 'class wxString' has no member named 'length'
C:/wxDev-C++/bin/../lib/gcc/mingw32/3.4.2/../../../../include/wx/string.h: In function `bool operator!=(const wxString&, const char*)':

C:/wxDev-C++/bin/../lib/gcc/mingw32/3.4.2/../../../../include/wx/string.h:1608: error: 'class wxString' has no member named 'c_str'
C:/wxDev-C++/bin/../lib/gcc/mingw32/3.4.2/../../../../include/wx/string.h: In function `wxString operator+(const wxString&, const char*)':
C:/wxDev-C++/bin/../lib/gcc/mingw32/3.4.2/../../../../include/wx/string.h:1618: error: 'class wxString' has no member named 'c_str'
In file included from C:/wxDev-C++/bin/../lib/gcc/mingw32/3.4.2/../../../../include/vector:71,
from C:/wxDev-C++/bin/../lib/gcc/mingw32/3.4.2/../../../../include/wx/dynarray.h:19,
from C:/wxDev-C++/bin/../lib/gcc/mingw32/3.4.2/../../../../include/wx/wx.h:17,
from Project1App.h:18,
from Project1App.cpp:10:
C:/wxDev-C++/bin/../lib/gcc/mingw32/3.4.2/../../../../include/bits/stl_vector.h: At global scope:
C:/wxDev-C++/bin/../lib/gcc/mingw32/3.4.2/../../../../include/bits/stl_vector.h:140: error: `allocator' has not been declared
C:/wxDev-C++/bin/../lib/gcc/mingw32/3.4.2/../../../../include/bits/stl_vector.h:140: error: expected `>' before '<' token
C:/wxDev-C++/bin/../lib/gcc/mingw32/3.4.2/../../../../include/bits/stl_vector.h:140: error: expected unqualified-id before '>' token
C:/wxDev-C++/bin/../lib/gcc/mingw32/3.4.2/../../../../include/bits/stl_vector.h:140: error: expected `;' before '>' token

C:/wxDev-C++/bin/../lib/gcc/mingw32/3.4.2/../../../../include/bits/stl_vector.h:876: error: expected `,' or `...' before '<' token
C:/wxDev-C++/bin/../lib/gcc/mingw32/3.4.2/../../../../include/bits/stl_vector.h:877: error: `bool _GLIBCXX_STD::operator==(int)' must have an argument of class or enumerated type
C:/wxDev-C++/bin/../lib/gcc/mingw32/3.4.2/../../../../include/bits/stl_vector.h:877: error: `bool _GLIBCXX_STD::operator==(int)' must take exactly two arguments
C:/wxDev-C++/bin/../lib/gcc/mingw32/3.4.2/../../../../include/bits/stl_vector.h: In function `bool _GLIBCXX_STD::operator==(int)':
C:/wxDev-C++/bin/../lib/gcc/mingw32/3.4.2/../../../../include/bits/stl_vector.h:878: error: `__x' undeclared (first use this function)
C:/wxDev-C++/bin/../lib/gcc/mingw32/3.4.2/../../../../include/bits/stl_vector.h:878: error: `__y' undeclared (first use this function)
C:/wxDev-C++/bin/../lib/gcc/mingw32/3.4.2/../../../../include/bits/stl_vector.h:879: error: no matching function for call to `equal(<type error>, <type error>, <type error>)'
C:/wxDev-C++/bin/../lib/gcc/mingw32/3.4.2/../../../../include/bits/stl_vector.h: At global scope:
C:/wxDev-C++/bin/../lib/gcc/mingw32/3.4.2/../../../../include/bits/stl_vector.h:895: error: expected `,' or `...' before '<' token
C:/wxDev-C++/bin/../lib/gcc/mingw32/3.4.2/../../../../include/bits/stl_vector.h:896: error: `bool _GLIBCXX_STD::operator<(int)' must have an argument of class or enumerated type
C:/wxDev-C++/bin/../lib/gcc/mingw32/3.4.2/../../../../include/bits/stl_vector.h:896: error: `bool _GLIBCXX_STD::operator<(int)' must take exactly two arguments
C:/wxDev-C++/bin/../lib/gcc/mingw32/3.4.2/../../../../include/bits/stl_vector.h: In function `bool _GLIBCXX_STD::operator<(int)':
C:/wxDev-C++/bin/../lib/gcc/mingw32/3.4.2/../../../../include/bits/stl_vector.h:897: error: `__x' undeclared (first use this function)
C:/wxDev-C++/bin/../lib/gcc/mingw32/3.4.2/../../../../include/bits/stl_vector.h:898: error: `__y' undeclared (first use this function)
C:/wxDev-C++/bin/../lib/gcc/mingw32/3.4.2/../../../../include/bits/stl_vector.h:898: error: no matching function for call to `lexicographical_compare(<type error>, <type error>, <type error>, <type error>)'
C:/wxDev-C++/bin/../lib/gcc/mingw32/3.4.2/../../../../include/bits/stl_algobase.h:808: note: candidates are: bool std::lexicographical_compare(const unsigned char*, const unsigned char*, const unsigned char*, const unsigned char*)
C:/wxDev-C++/bin/../lib/gcc/mingw32/3.4.2/../../../../include/bits/stl_algobase.h:822: note: bool std::lexicographical_compare(const char*, const char*, const char*, const char*)
C:/wxDev-C++/bin/../lib/gcc/mingw32/3.4.2/../../../../include/bits/stl_vector.h: At global scope:
C:/wxDev-C++/bin/../lib/gcc/mingw32/3.4.2/../../../../include/bits/stl_vector.h:904: error: expected `,' or `...' before '<' token
C:/wxDev-C++/bin/../lib/gcc/mingw32/3.4.2/../../../../include/bits/stl_vector.h:905: error: `bool _GLIBCXX_STD::operator!=(int)' must have an argument of class or enumerated type
C:/wxDev-C++/bin/../lib/gcc/mingw32/3.4.2/../../../../include/bits/stl_vector.h:905: error: `bool _GLIBCXX_STD::operator!=(int)' must take exactly two arguments
C:/wxDev-C++/bin/../lib/gcc/mingw32/3.4.2/../../../../include/bits/stl_vector.h: In function `bool _GLIBCXX_STD::operator!=(int)':
C:/wxDev-C++/bin/../lib/gcc/mingw32/3.4.2/../../../../include/bits/stl_vector.h:905: error: `__x' undeclared (first use this function)
C:/wxDev-C++/bin/../lib/gcc/mingw32/3.4.2/../../../../include/bits/stl_vector.h:905: error: `__y' undeclared (first use this function)
C:/wxDev-C++/bin/../lib/gcc/mingw32/3.4.2/../../../../include/bits/stl_vector.h: At global scope:
C:/wxDev-C++/bin/../lib/gcc/mingw32/3.4.2/../../../../include/bits/stl_vector.h:910: error: expected `,' or `...' before '<' token

C:/wxDev-C++/bin/../lib/gcc/mingw32/3.4.2/../../../../include/bits/stl_vector.h:911: error: `bool _GLIBCXX_STD::operator>(int)' must have an argument of class or enumerated type
C:/wxDev-C++/bin/../lib/gcc/mingw32/3.4.2/../../../../include/bits/stl_vector.h:911: error: `bool _GLIBCXX_STD::operator>(int)' must take exactly two arguments
C:/wxDev-C++/bin/../lib/gcc/mingw32/3.4.2/../../../../include/bits/stl_vector.h: In function `bool _GLIBCXX_STD::operator>(int)':
C:/wxDev-C++/bin/../lib/gcc/mingw32/3.4.2/../../../../include/bits/stl_vector.h:911: error: `__y' undeclared (first use this function)
C:/wxDev-C++/bin/../lib/gcc/mingw32/3.4.2/../../../../include/bits/stl_vector.h:911: error: `__x' undeclared (first use this function)
C:/wxDev-C++/bin/../lib/gcc/mingw32/3.4.2/../../../../include/bits/stl_vector.h: At global scope:
C:/wxDev-C++/bin/../lib/gcc/mingw32/3.4.2/../../../../include/bits/stl_vector.h:916: error: expected `,' or `...' before '<' token
C:/wxDev-C++/bin/../lib/gcc/mingw32/3.4.2/../../../../include/bits/stl_vector.h:917: error: `bool _GLIBCXX_STD::operator<=(int)' must have an argument of class or enumerated type
C:/wxDev-C++/bin/../lib/gcc/mingw32/3.4.2/../../../../include/bits/stl_vector.h:917: error: `bool _GLIBCXX_STD::operator<=(int)' must take exactly two arguments
C:/wxDev-C++/bin/../lib/gcc/mingw32/3.4.2/../../../../include/bits/stl_vector.h: In function `bool _GLIBCXX_STD::operator<=(int)':
C:/wxDev-C++/bin/../lib/gcc/mingw32/3.4.2/../../../../include/bits/stl_vector.h:917: error: `__y' undeclared (first use this function)

C:/wxDev-C++/bin/../lib/gcc/mingw32/3.4.2/../../../../include/bits/stl_vector.h:917: error: `__x' undeclared (first use this function)
C:/wxDev-C++/bin/../lib/gcc/mingw32/3.4.2/../../../../include/bits/stl_vector.h: At global scope:
C:/wxDev-C++/bin/../lib/gcc/mingw32/3.4.2/../../../../include/bits/stl_vector.h:922: error: expected `,' or `...' before '<' token
C:/wxDev-C++/bin/../lib/gcc/mingw32/3.4.2/../../../../include/bits/stl_vector.h:923: error: `bool _GLIBCXX_STD::operator>=(int)' must have an argument of class or enumerated type
C:/wxDev-C++/bin/../lib/gcc/mingw32/3.4.2/../../../../include/bits/stl_vector.h:923: error: `bool _GLIBCXX_STD::operator>=(int)' must take exactly two arguments
C:/wxDev-C++/bin/../lib/gcc/mingw32/3.4.2/../../../../include/bits/stl_vector.h: In function `bool _GLIBCXX_STD::operator>=(int)':
C:/wxDev-C++/bin/../lib/gcc/mingw32/3.4.2/../../../../include/bits/stl_vector.h:923: error: `__x' undeclared (first use this function)
C:/wxDev-C++/bin/../lib/gcc/mingw32/3.4.2/../../../../include/bits/stl_vector.h:923: error: `__y' undeclared (first use this function)
C:/wxDev-C++/bin/../lib/gcc/mingw32/3.4.2/../../../../include/bits/stl_vector.h: At global scope:
C:/wxDev-C++/bin/../lib/gcc/mingw32/3.4.2/../../../../include/bits/stl_vector.h:928: error: variable or field `swap' declared void

C:/wxDev-C++/bin/../lib/gcc/mingw32/3.4.2/../../../../include/bits/stl_vector.h:928: error: `_GLIBCXX_STD::swap' declared as an `inline' variable
C:/wxDev-C++/bin/../lib/gcc/mingw32/3.4.2/../../../../include/bits/stl_vector.h:928: error: template declaration of `int _GLIBCXX_STD::swap'
C:/wxDev-C++/bin/../lib/gcc/mingw32/3.4.2/../../../../include/bits/stl_vector.h:928: error: `vector' was not declared in this scope
C:/wxDev-C++/bin/../lib/gcc/mingw32/3.4.2/../../../../include/bits/stl_vector.h:928: error: expected primary-expression before ',' token

C:/wxDev-C++/bin/../lib/gcc/mingw32/3.4.2/../../../../include/bits/stl_vector.h:928: error: expected primary-expression before '>' token
C:/wxDev-C++/bin/../lib/gcc/mingw32/3.4.2/../../../../include/bits/stl_vector.h:928: error: `__x' was not declared in this scope
C:/wxDev-C++/bin/../lib/gcc/mingw32/3.4.2/../../../../include/bits/stl_vector.h:928: error: `vector' was not declared in this scope
C:/wxDev-C++/bin/../lib/gcc/mingw32/3.4.2/../../../../include/bits/stl_vector.h:928: error: expected primary-expression before ',' token
C:/wxDev-C++/bin/../lib/gcc/mingw32/3.4.2/../../../../include/bits/stl_vector.h:928: error: expected primary-expression before '>' token
C:/wxDev-C++/bin/../lib/gcc/mingw32/3.4.2/../../../../include/bits/stl_vector.h:928: error: `__y' was not declared in this scope
C:/wxDev-C++/bin/../lib/gcc/mingw32/3.4.2/../../../../include/bits/stl_vector.h:929: error: expected `;' before '{' token
In file included from C:/wxDev-C++/bin/../lib/gcc/mingw32/3.4.2/../../../../include/vector:72,
from C:/wxDev-C++/bin/../lib/gcc/mingw32/3.4.2/../../../../include/wx/dynarray.h:19,
from C:/wxDev-C++/bin/../lib/gcc/mingw32/3.4.2/../../../../include/wx/wx.h:17,
from Project1App.h:18,
from Project1App.cpp:10:
C:/wxDev-C++/bin/../lib/gcc/mingw32/3.4.2/../../../../include/bits/stl_bvector.h:107: error: expected template-name before '<' token
C:/wxDev-C++/bin/../lib/gcc/mingw32/3.4.2/../../../../include/bits/stl_bvector.h:107: error: expected `{' before '<' token

C:/wxDev-C++/bin/../lib/gcc/mingw32/3.4.2/../../../../include/bits/stl_bvector.h:107: error: expected unqualified-id before '<' token
C:/wxDev-C++/bin/../lib/gcc/mingw32/3.4.2/../../../../include/bits/stl_bvector.h:107: error: expected `,' or `;' before '<' token
C:/wxDev-C++/bin/../lib/gcc/mingw32/3.4.2/../../../../include/bits/stl_bvector.h: In function `ptrdiff_t _GLIBCXX_STD::operator-(const _GLIBCXX_STD::_Bit_iterator_base&, const _GLIBCXX_STD::_Bit_iterator_base&)':

C:/wxDev-C++/bin/../lib/gcc/mingw32/3.4.2/../../../../include/bits/stl_bvector.h:181: error: invalid use of undefined type `const struct _GLIBCXX_STD::_Bit_iterator_base'
C:/wxDev-C++/bin/../lib/gcc/mingw32/3.4.2/../../../../include/bits/stl_bvector.h:107: error: forward declaration of `const struct _GLIBCXX_STD::_Bit_iterator_base'
C:/wxDev-C++/bin/../lib/gcc/mingw32/3.4.2/../../../../include/bits/stl_bvector.h:181: error: invalid use of undefined type `const struct _GLIBCXX_STD::_Bit_iterator_base'
C:/wxDev-C++/bin/../lib/gcc/mingw32/3.4.2/../../../../include/bits/stl_bvector.h:107: error: forward declaration of `const struct _GLIBCXX_STD::_Bit_iterator_base'
C:/wxDev-C++/bin/../lib/gcc/mingw32/3.4.2/../../../../include/bits/stl_bvector.h:181: error: invalid use of undefined type `const struct _GLIBCXX_STD::_Bit_iterator_base'
C:/wxDev-C++/bin/../lib/gcc/mingw32/3.4.2/../../../../include/bits/stl_bvector.h:107: error: forward declaration of `const struct _GLIBCXX_STD::_Bit_iterator_base'
C:/wxDev-C++/bin/../lib/gcc/mingw32/3.4.2/../../../../include/bits/stl_bvector.h:181: error: invalid use of undefined type `const struct _GLIBCXX_STD::_Bit_iterator_base'
C:/wxDev-C++/bin/../lib/gcc/mingw32/3.4.2/../../../../include/bits/stl_bvector.h:107: error: forward declaration of `const struct _GLIBCXX_STD::_Bit_iterator_base'
C:/wxDev-C++/bin/../lib/gcc/mingw32/3.4.2/../../../../include/bits/stl_bvector.h: At global scope:
C:/wxDev-C++/bin/../lib/gcc/mingw32/3.4.2/../../../../include/bits/stl_bvector.h:185: error: invalid use of undefined type `struct _GLIBCXX_STD::_Bit_iterator_base'
C:/wxDev-C++/bin/../lib/gcc/mingw32/3.4.2/../../../../include/bits/stl_bvector.h:107: error: forward declaration of `struct _GLIBCXX_STD::_Bit_iterator_base'
C:/wxDev-C++/bin/../lib/gcc/mingw32/3.4.2/../../../../include/bits/stl_bvector.h:228: error: declaration of `operator+=' as non-function
C:/wxDev-C++/bin/../lib/gcc/mingw32/3.4.2/../../../../include/bits/stl_bvector.h:228: error: expected `;' before '(' token
C:/wxDev-C++/bin/../lib/gcc/mingw32/3.4.2/../../../../include/bits/stl_bvector.h:234: error: expected `;' before "iterator"

C:/wxDev-C++/bin/../lib/gcc/mingw32/3.4.2/../../../../include/bits/stl_bvector.h:235: error: declaration of `operator-=' as non-function
C:/wxDev-C++/bin/../lib/gcc/mingw32/3.4.2/../../../../include/bits/stl_bvector.h:235: error: expected `;' before '(' token
C:/wxDev-C++/bin/../lib/gcc/mingw32/3.4.2/../../../../include/bits/stl_bvector.h:241: error: expected `;' before "iterator"
C:/wxDev-C++/bin/../lib/gcc/mingw32/3.4.2/../../../../include/bits/stl_bvector.h:242: error: declaration of `operator+' as non-function
C:/wxDev-C++/bin/../lib/gcc/mingw32/3.4.2/../../../../include/bits/stl_bvector.h:242: error: expected `;' before '(' token
C:/wxDev-C++/bin/../lib/gcc/mingw32/3.4.2/../../../../include/bits/stl_bvector.h:248: error: expected `;' before "iterator"
C:/wxDev-C++/bin/../lib/gcc/mingw32/3.4.2/../../../../include/bits/stl_bvector.h:249: error: declaration of `operator-' as non-function
C:/wxDev-C++/bin/../lib/gcc/mingw32/3.4.2/../../../../include/bits/stl_bvector.h:249: error: expected `;' before '(' token
C:/wxDev-C++/bin/../lib/gcc/mingw32/3.4.2/../../../../include/bits/stl_bvector.h:255: error: expected `;' before "reference"
C:/wxDev-C++/bin/../lib/gcc/mingw32/3.4.2/../../../../include/bits/stl_bvector.h:256: error: declaration of `operator[]' as non-function
C:/wxDev-C++/bin/../lib/gcc/mingw32/3.4.2/../../../../include/bits/stl_bvector.h:256: error: expected `;' before '(' token
C:/wxDev-C++/bin/../lib/gcc/mingw32/3.4.2/../../../../include/bits/stl_bvector.h:258: error: expected `;' before '}' token
C:/wxDev-C++/bin/../lib/gcc/mingw32/3.4.2/../../../../include/bits/stl_bvector.h: In constructor `_GLIBCXX_STD::_Bit_iterator::_Bit_iterator()':
C:/wxDev-C++/bin/../lib/gcc/mingw32/3.4.2/../../../../include/bits/stl_bvector.h:190: error: type `struct _GLIBCXX_STD::_Bit_iterator_base' is not a direct base of `_GLIBCXX_STD::_Bit_iterator'
C:/wxDev-C++/bin/../lib/gcc/mingw32/3.4.2/../../../../include/bits/stl_bvector.h: In constructor `_GLIBCXX_STD::_Bit_iterator::_Bit_iterator(_GLIBCXX_STD::_Bit_type*, unsigned int)':
C:/wxDev-C++/bin/../lib/gcc/mingw32/3.4.2/../../../../include/bits/stl_bvector.h:192: error: type `struct _GLIBCXX_STD::_Bit_iterator_base' is not a direct base of `_GLIBCXX_STD::_Bit_iterator'
C:/wxDev-C++/bin/../lib/gcc/mingw32/3.4.2/../../../../include/bits/stl_bvector.h: In member function `_GLIBCXX_STD::_Bit_reference _GLIBCXX_STD::_Bit_iterator::operator*() const':
C:/wxDev-C++/bin/../lib/gcc/mingw32/3.4.2/../../../../include/bits/stl_bvector.h:195: error: `_M_p' undeclared (first use this function)
C:/wxDev-C++/bin/../lib/gcc/mingw32/3.4.2/../../../../include/bits/stl_bvector.h:195: error: `_M_offset' undeclared (first use this function)
C:/wxDev-C++/bin/../lib/gcc/mingw32/3.4.2/../../../../include/bits/stl_bvector.h: In member function `_GLIBCXX_STD::_Bit_iterator& _GLIBCXX_STD::_Bit_iterator::operator++()':
C:/wxDev-C++/bin/../lib/gcc/mingw32/3.4.2/../../../../include/bits/stl_bvector.h:200: error: `_M_bump_up' undeclared (first use this function)
C:/wxDev-C++/bin/../lib/gcc/mingw32/3.4.2/../../../../include/bits/stl_bvector.h: In member function `_GLIBCXX_STD::_Bit_iterator _GLIBCXX_STD::_Bit_iterator::operator++(int)':
C:/wxDev-C++/bin/../lib/gcc/mingw32/3.4.2/../../../../include/bits/stl_bvector.h:208: error: `_M_bump_up' undeclared (first use this function)
C:/wxDev-C++/bin/../lib/gcc/mingw32/3.4.2/../../../../include/bits/stl_bvector.h: In member function `_GLIBCXX_STD::_Bit_iterator& _GLIBCXX_STD::_Bit_iterator::operator--()':
C:/wxDev-C++/bin/../lib/gcc/mingw32/3.4.2/../../../../include/bits/stl_bvector.h:215: error: `_M_bump_down' undeclared (first use this function)
C:/wxDev-C++/bin/../lib/gcc/mingw32/3.4.2/../../../../include/bits/stl_bvector.h: In member function `_GLIBCXX_STD::_Bit_iterator _GLIBCXX_STD::_Bit_iterator::operator--(int)':
C:/wxDev-C++/bin/../lib/gcc/mingw32/3.4.2/../../../../include/bits/stl_bvector.h:223: error: `_M_bump_down' undeclared (first use this function)

C:/wxDev-C++/bin/../lib/gcc/mingw32/3.4.2/../../../../include/bits/stl_bvector.h: In function `_GLIBCXX_STD::_Bit_iterator _GLIBCXX_STD::operator+(ptrdiff_t, const _GLIBCXX_STD::_Bit_iterator&)':
C:/wxDev-C++/bin/../lib/gcc/mingw32/3.4.2/../../../../include/bits/stl_bvector.h:261: error: no match for 'operator+' in '__x + __n'
C:/wxDev-C++/bin/../lib/gcc/mingw32/3.4.2/../../../../include/bits/stl_bvector.h:261: note: candidates are: _GLIBCXX_STD::_Bit_iterator _GLIBCXX_STD::operator+(ptrdiff_t, const _GLIBCXX_STD::_Bit_iterator&)
C:/wxDev-C++/bin/../lib/gcc/mingw32/3.4.2/../../../../include/bits/stl_bvector.h: At global scope:
C:/wxDev-C++/bin/../lib/gcc/mingw32/3.4.2/../../../../include/bits/stl_bvector.h:265: error: invalid use of undefined type `struct _GLIBCXX_STD::_Bit_iterator_base'
C:/wxDev-C++/bin/../lib/gcc/mingw32/3.4.2/../../../../include/bits/stl_bvector.h:107: error: forward declaration of `struct _GLIBCXX_STD::_Bit_iterator_base'
C:/wxDev-C++/bin/../lib/gcc/mingw32/3.4.2/../../../../include/bits/stl_bvector.h:312: error: declaration of `operator+=' as non-function
C:/wxDev-C++/bin/../lib/gcc/mingw32/3.4.2/../../../../include/bits/stl_bvector.h:312: error: expected `;' before '(' token
C:/wxDev-C++/bin/../lib/gcc/mingw32/3.4.2/../../../../include/bits/stl_bvector.h:318: error: expected `;' before "const_iterator"
C:/wxDev-C++/bin/../lib/gcc/mingw32/3.4.2/../../../../include/bits/stl_bvector.h:319: error: declaration of `operator-=' as non-function
C:/wxDev-C++/bin/../lib/gcc/mingw32/3.4.2/../../../../include/bits/stl_bvector.h:319: error: expected `;' before '(' token
C:/wxDev-C++/bin/../lib/gcc/mingw32/3.4.2/../../../../include/bits/stl_bvector.h:325: error: expected `;' before "const_iterator"
C:/wxDev-C++/bin/../lib/gcc/mingw32/3.4.2/../../../../include/bits/stl_bvector.h:326: error: declaration of `operator+' as non-function
C:/wxDev-C++/bin/../lib/gcc/mingw32/3.4.2/../../../../include/bits/stl_bvector.h:326: error: expected `;' before '(' token
C:/wxDev-C++/bin/../lib/gcc/mingw32/3.4.2/../../../../include/bits/stl_bvector.h:331: error: expected `;' before "const_iterator"
C:/wxDev-C++/bin/../lib/gcc/mingw32/3.4.2/../../../../include/bits/stl_bvector.h:332: error: declaration of `operator-' as non-function
C:/wxDev-C++/bin/../lib/gcc/mingw32/3.4.2/../../../../include/bits/stl_bvector.h:332: error: expected `;' before '(' token
C:/wxDev-C++/bin/../lib/gcc/mingw32/3.4.2/../../../../include/bits/stl_bvector.h:338: error: expected `;' before "const_reference"
C:/wxDev-C++/bin/../lib/gcc/mingw32/3.4.2/../../../../include/bits/stl_bvector.h:339: error: declaration of `operator[]' as non-function
C:/wxDev-C++/bin/../lib/gcc/mingw32/3.4.2/../../../../include/bits/stl_bvector.h:339: error: expected `;' before '(' token
C:/wxDev-C++/bin/../lib/gcc/mingw32/3.4.2/../../../../include/bits/stl_bvector.h:341: error: expected `;' before '}' token
C:/wxDev-C++/bin/../lib/gcc/mingw32/3.4.2/../../../../include/bits/stl_bvector.h: In constructor `_GLIBCXX_STD::_Bit_const_iterator::_Bit_const_iterator()':
C:/wxDev-C++/bin/../lib/gcc/mingw32/3.4.2/../../../../include/bits/stl_bvector.h:271: error: type `struct _GLIBCXX_STD::_Bit_iterator_base' is not a direct base of `_GLIBCXX_STD::_Bit_const_iterator'

C:/wxDev-C++/bin/../lib/gcc/mingw32/3.4.2/../../../../include/bits/stl_bvector.h: In constructor `_GLIBCXX_STD::_Bit_const_iterator::_Bit_const_iterator(_GLIBCXX_STD::_Bit_type*, unsigned int)':
C:/wxDev-C++/bin/../lib/gcc/mingw32/3.4.2/../../../../include/bits/stl_bvector.h:2

lowjoel
Moderator
Moderator
Posts: 1511
Joined: Sun Jun 19, 2005 11:37 am
Location: Singapore
Contact:

Post by lowjoel » Tue Jul 04, 2006 8:26 am

tools > compiler settings > binaries > set g++ to be cl, gcc to be cl.

Update the include paths

ross
Experienced Solver
Experienced Solver
Posts: 74
Joined: Tue Sep 14, 2004 12:09 am
Location: Australia

Post by ross » Tue Jul 04, 2006 10:06 pm

Getting close now I think.

This is what i get now:

Compiler: vc2003
Building Makefile: "C:\wxDev-C++\Projects\p1\Makefile.win"
Executing make...
make.exe -f "C:\wxDev-C++\Projects\p1\Makefile.win" all
make.exe: *** No rule to make target `C:/wxDev-C++/Projects/p1/Project1_private.res', needed by `Project1.exe'. Stop.

Execution terminated
Compilation successful

lowjoel
Moderator
Moderator
Posts: 1511
Joined: Sun Jun 19, 2005 11:37 am
Location: Singapore
Contact:

Post by lowjoel » Tue Jul 04, 2006 10:13 pm

rebuild-all. Have you tried?

ross
Experienced Solver
Experienced Solver
Posts: 74
Joined: Tue Sep 14, 2004 12:09 am
Location: Australia

Post by ross » Wed Jul 05, 2006 6:35 am

This is what i get:

Compiler: VC2003
Building Makefile: "C:\wxDev-C++\Projects\p1\Makefile.win"
Executing make clean
rm -f Project1App.obj Project1Frm.obj C:/wxDev-C++/Projects/p1/Project1_private.res Project1.exe

cl.exe /nologo /c Project1App.cpp /FoProject1App.obj /I"C:/Program Files/Microsoft Platform SDK/Include" /I"C:/wxDev-C++/lib/vc_dll/mswu/wx/msw" /I"C:/wxDev-C++/include" /I"C:/Program Files/Microsoft Visual Studio .NET 2003/Vc7/include" /I"C:/Program Files/Microsoft Platform SDK/Include" /I"C:/wxDev-C++/include" /D_UNICODE /D__WXMSW__ /DWIN32 /DWXUSINGDLL /D_WIN32_IE=0x0600 /DwxUSE_UNICODE_MSLU=1 /MD /EHa /QIfdiv /QI0f /QIfist /Ze

Project1App.cpp

C:/wxDev-C++\include\wctype.h(67) : error C2065: 'wint_t' : undeclared identifier

C:/wxDev-C++\include\wctype.h(67) : warning C4229: anachronism used : modifiers on data are ignored

C:/wxDev-C++\include\wctype.h(67) : error C2491: 'iswalnum' : definition of dllimport data not allowed

C:/wxDev-C++\include\wctype.h(68) : error C3861: 'wint_t': identifier not found, even with argument-dependent lookup
C:/wxDev-C++\include\wctype.h(68) : warning C4229: anachronism used : modifiers on data are ignored
C:/wxDev-C++\include\wctype.h(68) : error C2491: 'iswalpha' : definition of dllimport data not allowed
C:/wxDev-C++\include\wctype.h(69) : error C3861: 'wint_t': identifier not found, even with argument-dependent lookup
C:/wxDev-C++\include\wctype.h(69) : warning C4229: anachronism used : modifiers on data are ignored
C:/wxDev-C++\include\wctype.h(69) : error C2491: 'iswascii' : definition of dllimport data not allowed

C:/wxDev-C++\include\wctype.h(70) : error C3861: 'wint_t': identifier not found, even with argument-dependent lookup
C:/wxDev-C++\include\wctype.h(70) : warning C4229: anachronism used : modifiers on data are ignored
C:/wxDev-C++\include\wctype.h(70) : error C2491: 'iswcntrl' : definition of dllimport data not allowed
C:/wxDev-C++\include\wctype.h(71) : error C3861: 'wint_t': identifier not found, even with argument-dependent lookup
C:/wxDev-C++\include\wctype.h(71) : error C2275: 'wctype_t' : illegal use of this type as an expression

C:/wxDev-C++\include\wctype.h(62) : see declaration of 'wctype_t'
C:/wxDev-C++\include\wctype.h(71) : warning C4229: anachronism used : modifiers on data are ignored

C:/wxDev-C++\include\wctype.h(71) : error C2491: 'iswctype' : definition of dllimport data not allowed
C:/wxDev-C++\include\wctype.h(71) : error C2078: too many initializers

C:/wxDev-C++\include\wctype.h(71) : error C2275: 'wctype_t' : illegal use of this type as an expression
C:/wxDev-C++\include\wctype.h(62) : see declaration of 'wctype_t'
C:/wxDev-C++\include\wctype.h(72) : error C3861: 'wint_t': identifier not found, even with argument-dependent lookup
C:/wxDev-C++\include\wctype.h(72) : error C2275: 'wctype_t' : illegal use of this type as an expression
C:/wxDev-C++\include\wctype.h(62) : see declaration of 'wctype_t'
C:/wxDev-C++\include\wctype.h(72) : warning C4229: anachronism used : modifiers on data are ignored
C:/wxDev-C++\include\wctype.h(72) : error C2491: 'is_wctype' : definition of dllimport data not allowed
C:/wxDev-C++\include\wctype.h(72) : error C2078: too many initializers
C:/wxDev-C++\include\wctype.h(72) : error C2275: 'wctype_t' : illegal use of this type as an expression
C:/wxDev-C++\include\wctype.h(62) : see declaration of 'wctype_t'
C:/wxDev-C++\include\wctype.h(73) : error C3861: 'wint_t': identifier not found, even with argument-dependent lookup
C:/wxDev-C++\include\wctype.h(73) : warning C4229: anachronism used : modifiers on data are ignored
C:/wxDev-C++\include\wctype.h(73) : error C2491: 'iswdigit' : definition of dllimport data not allowed
C:/wxDev-C++\include\wctype.h(74) : error C3861: 'wint_t': identifier not found, even with argument-dependent lookup
C:/wxDev-C++\include\wctype.h(74) : warning C4229: anachronism used : modifiers on data are ignored

C:/wxDev-C++\include\wctype.h(74) : error C2491: 'iswgraph' : definition of dllimport data not allowed
C:/wxDev-C++\include\wctype.h(75) : error C3861: 'wint_t': identifier not found, even with argument-dependent lookup
C:/wxDev-C++\include\wctype.h(75) : warning C4229: anachronism used : modifiers on data are ignored
C:/wxDev-C++\include\wctype.h(75) : error C2491: 'iswlower' : definition of dllimport data not allowed
C:/wxDev-C++\include\wctype.h(76) : error C3861: 'wint_t': identifier not found, even with argument-dependent lookup
C:/wxDev-C++\include\wctype.h(76) : warning C4229: anachronism used : modifiers on data are ignored
C:/wxDev-C++\include\wctype.h(76) : error C2491: 'iswprint' : definition of dllimport data not allowed

C:/wxDev-C++\include\wctype.h(77) : error C3861: 'wint_t': identifier not found, even with argument-dependent lookup
C:/wxDev-C++\include\wctype.h(77) : warning C4229: anachronism used : modifiers on data are ignored
C:/wxDev-C++\include\wctype.h(77) : error C2491: 'iswpunct' : definition of dllimport data not allowed
C:/wxDev-C++\include\wctype.h(78) : error C3861: 'wint_t': identifier not found, even with argument-dependent lookup
C:/wxDev-C++\include\wctype.h(78) : warning C4229: anachronism used : modifiers on data are ignored
C:/wxDev-C++\include\wctype.h(78) : error C2491: 'iswspace' : definition of dllimport data not allowed

C:/wxDev-C++\include\wctype.h(79) : error C3861: 'wint_t': identifier not found, even with argument-dependent lookup
C:/wxDev-C++\include\wctype.h(79) : warning C4229: anachronism used : modifiers on data are ignored
C:/wxDev-C++\include\wctype.h(79) : error C2491: 'iswupper' : definition of dllimport data not allowed
C:/wxDev-C++\include\wctype.h(80) : error C3861: 'wint_t': identifier not found, even with argument-dependent lookup
C:/wxDev-C++\include\wctype.h(80) : warning C4229: anachronism used : modifiers on data are ignored
C:/wxDev-C++\include\wctype.h(80) : error C2491: 'iswxdigit' : definition of dllimport data not allowed

C:/wxDev-C++\include\wctype.h(85) : error C2143: syntax error : missing ';' before '__cdecl'
C:/wxDev-C++\include\wctype.h(85) : error C2501: 'wint_t' : missing storage-class or type specifiers
C:/wxDev-C++\include\wctype.h(85) : error C2371: 'wint_t' : redefinition; different basic types
C:/wxDev-C++\include\wctype.h(85) : error C3861: 'wint_t': identifier not found, even with argument-dependent lookup
C:/wxDev-C++\include\wctype.h(85) : warning C4229: anachronism used : modifiers on data are ignored

C:/wxDev-C++\include\wctype.h(85) : error C2501: 'towlower' : missing storage-class or type specifiers
C:/wxDev-C++\include\wctype.h(86) : error C2143: syntax error : missing ';' before '__cdecl'
C:/wxDev-C++\include\wctype.h(86) : error C2501: 'wint_t' : missing storage-class or type specifiers
C:/wxDev-C++\include\wctype.h(86) : error C2371: 'wint_t' : redefinition; different basic types
C:/wxDev-C++\include\wctype.h(86) : error C3861: 'wint_t': identifier not found, even with argument-dependent lookup
C:/wxDev-C++\include\wctype.h(86) : warning C4229: anachronism used : modifiers on data are ignored
C:/wxDev-C++\include\wctype.h(86) : error C2501: 'towupper' : missing storage-class or type specifiers

C:/wxDev-C++\include\wctype.h(117) : error C3861: 'wint_t': identifier not found, even with argument-dependent lookup
C:/wxDev-C++\include\wctype.h(117) : error C2146: syntax error : missing ')' before identifier 'wc'
C:/wxDev-C++\include\wctype.h(117) : warning C4229: anachronism used : modifiers on data are ignored
C:/wxDev-C++\include\wctype.h(117) : error C2433: 'iswalnum' : 'inline' not permitted on data declarations
C:/wxDev-C++\include\wctype.h(117) : warning C4273: 'iswalnum' : inconsistent dll linkage
C:/wxDev-C++\include\wctype.h(117) : error C2059: syntax error : ')'
C:/wxDev-C++\include\wctype.h(117) : error C2143: syntax error : missing ';' before '{'

C:/wxDev-C++\include\wctype.h(117) : error C2447: '{' : missing function header (old-style formal list?)
C:/wxDev-C++\include\wctype.h(118) : error C3861: 'wint_t': identifier not found, even with argument-dependent lookup
C:/wxDev-C++\include\wctype.h(118) : error C2146: syntax error : missing ')' before identifier 'wc'
C:/wxDev-C++\include\wctype.h(118) : warning C4229: anachronism used : modifiers on data are ignored
C:/wxDev-C++\include\wctype.h(118) : error C2433: 'iswalpha' : 'inline' not permitted on data declarations
C:/wxDev-C++\include\wctype.h(118) : warning C4273: 'iswalpha' : inconsistent dll linkage

C:/wxDev-C++\include\wctype.h(118) : error C2059: syntax error : ')'
C:/wxDev-C++\include\wctype.h(118) : error C2143: syntax error : missing ';' before '{'
C:/wxDev-C++\include\wctype.h(118) : error C2447: '{' : missing function header (old-style formal list?)
C:/wxDev-C++\include\wctype.h(119) : error C3861: 'wint_t': identifier not found, even with argument-dependent lookup

C:/wxDev-C++\include\wctype.h(119) : error C2146: syntax error : missing ')' before identifier 'wc'
C:/wxDev-C++\include\wctype.h(119) : warning C4229: anachronism used : modifiers on data are ignored
C:/wxDev-C++\include\wctype.h(119) : error C2433: 'iswascii' : 'inline' not permitted on data declarations
C:/wxDev-C++\include\wctype.h(119) : warning C4273: 'iswascii' : inconsistent dll linkage
C:/wxDev-C++\include\wctype.h(119) : error C2059: syntax error : ')'
C:/wxDev-C++\include\wctype.h(119) : error C2143: syntax error : missing ';' before '{'
C:/wxDev-C++\include\wctype.h(119) : error C2447: '{' : missing function header (old-style formal list?)
C:/wxDev-C++\include\wctype.h(120) : error C3861: 'wint_t': identifier not found, even with argument-dependent lookup
C:/wxDev-C++\include\wctype.h(120) : error C2146: syntax error : missing ')' before identifier 'wc'

C:/wxDev-C++\include\wctype.h(120) : warning C4229: anachronism used : modifiers on data are ignored
C:/wxDev-C++\include\wctype.h(120) : error C2433: 'iswcntrl' : 'inline' not permitted on data declarations
C:/wxDev-C++\include\wctype.h(120) : warning C4273: 'iswcntrl' : inconsistent dll linkage
C:/wxDev-C++\include\wctype.h(120) : error C2059: syntax error : ')'
C:/wxDev-C++\include\wctype.h(120) : error C2143: syntax error : missing ';' before '{'
C:/wxDev-C++\include\wctype.h(120) : error C2447: '{' : missing function header (old-style formal list?)

C:/wxDev-C++\include\wctype.h(121) : error C3861: 'wint_t': identifier not found, even with argument-dependent lookup
C:/wxDev-C++\include\wctype.h(121) : error C2146: syntax error : missing ')' before identifier 'wc'
C:/wxDev-C++\include\wctype.h(121) : warning C4229: anachronism used : modifiers on data are ignored
C:/wxDev-C++\include\wctype.h(121) : error C2433: 'iswdigit' : 'inline' not permitted on data declarations
C:/wxDev-C++\include\wctype.h(121) : warning C4273: 'iswdigit' : inconsistent dll linkage
C:/wxDev-C++\include\wctype.h(121) : error C2059: syntax error : ')'
C:/wxDev-C++\include\wctype.h(121) : error C2143: syntax error : missing ';' before '{'

C:/wxDev-C++\include\wctype.h(121) : error C2447: '{' : missing function header (old-style formal list?)
C:/wxDev-C++\include\wctype.h(122) : error C3861: 'wint_t': identifier not found, even with argument-dependent lookup
C:/wxDev-C++\include\wctype.h(122) : error C2146: syntax error : missing ')' before identifier 'wc'
C:/wxDev-C++\include\wctype.h(122) : warning C4229: anachronism used : modifiers on data are ignored
C:/wxDev-C++\include\wctype.h(122) : error C2433: 'iswgraph' : 'inline' not permitted on data declarations
C:/wxDev-C++\include\wctype.h(122) : warning C4273: 'iswgraph' : inconsistent dll linkage

C:/wxDev-C++\include\wctype.h(122) : error C2059: syntax error : ')'
C:/wxDev-C++\include\wctype.h(122) : error C2143: syntax error : missing ';' before '{'
C:/wxDev-C++\include\wctype.h(122) : error C2447: '{' : missing function header (old-style formal list?)
C:/wxDev-C++\include\wctype.h(123) : error C3861: 'wint_t': identifier not found, even with argument-dependent lookup

C:/wxDev-C++\include\wctype.h(123) : error C2146: syntax error : missing ')' before identifier 'wc'
C:/wxDev-C++\include\wctype.h(123) : warning C4229: anachronism used : modifiers on data are ignored
C:/wxDev-C++\include\wctype.h(123) : error C2433: 'iswlower' : 'inline' not permitted on data declarations
C:/wxDev-C++\include\wctype.h(123) : warning C4273: 'iswlower' : inconsistent dll linkage
C:/wxDev-C++\include\wctype.h(123) : error C2059: syntax error : ')'
C:/wxDev-C++\include\wctype.h(123) : error C2143: syntax error : missing ';' before '{'
C:/wxDev-C++\include\wctype.h(123) : error C2447: '{' : missing function header (old-style formal list?)
C:/wxDev-C++\include\wctype.h(124) : error C3861: 'wint_t': identifier not found, even with argument-dependent lookup
C:/wxDev-C++\include\wctype.h(124) : error C2146: syntax error : missing ')' before identifier 'wc'

C:/wxDev-C++\include\wctype.h(124) : warning C4229: anachronism used : modifiers on data are ignored
C:/wxDev-C++\include\wctype.h(124) : error C2433: 'iswprint' : 'inline' not permitted on data declarations
C:/wxDev-C++\include\wctype.h(124) : warning C4273: 'iswprint' : inconsistent dll linkage
C:/wxDev-C++\include\wctype.h(124) : error C2059: syntax error : ')'
C:/wxDev-C++\include\wctype.h(124) : error C2143: syntax error : missing ';' before '{'
C:/wxDev-C++\include\wctype.h(124) : error C2447: '{' : missing function header (old-style formal list?)

C:/wxDev-C++\include\wctype.h(125) : error C3861: 'wint_t': identifier not found, even with argument-dependent lookup
C:/wxDev-C++\include\wctype.h(125) : error C2146: syntax error : missing ')' before identifier 'wc'
C:/wxDev-C++\include\wctype.h(125) : warning C4229: anachronism used : modifiers on data are ignored
C:/wxDev-C++\include\wctype.h(125) : error C2433: 'iswpunct' : 'inline' not permitted on data declarations
C:/wxDev-C++\include\wctype.h(125) : warning C4273: 'iswpunct' : inconsistent dll linkage
C:/wxDev-C++\include\wctype.h(125) : error C2059: syntax error : ')'
C:/wxDev-C++\include\wctype.h(125) : error C2143: syntax error : missing ';' before '{'

C:/wxDev-C++\include\wctype.h(125) : error C2447: '{' : missing function header (old-style formal list?)
C:/wxDev-C++\include\wctype.h(126) : error C3861: 'wint_t': identifier not found, even with argument-dependent lookup
C:/wxDev-C++\include\wctype.h(126) : error C2146: syntax error : missing ')' before identifier 'wc'
C:/wxDev-C++\include\wctype.h(126) : warning C4229: anachronism used : modifiers on data are ignored
C:/wxDev-C++\include\wctype.h(126) : error C2433: 'iswspace' : 'inline' not permitted on data declarations
C:/wxDev-C++\include\wctype.h(126) : fatal error C1003: error count exceeds 100; stopping compilation

make.exe: *** [Project1App.obj] Error 2

Execution terminated

ross
Experienced Solver
Experienced Solver
Posts: 74
Joined: Tue Sep 14, 2004 12:09 am
Location: Australia

Post by ross » Wed Jul 05, 2006 6:54 am

wheres the instruction page???

lowjoel
Moderator
Moderator
Posts: 1511
Joined: Sun Jun 19, 2005 11:37 am
Location: Singapore
Contact:

Post by lowjoel » Wed Jul 05, 2006 9:06 am

go to tools>compiler options>paths>include set the %VCDIR%\include to be right on top.

Post Reply