Search found 3 matches

by nkulowiec
Tue Aug 07, 2018 2:03 pm
Forum: Platform Related Issues
Topic: Solaris Build Failure wxWidgets 3.1.1
Replies: 5
Views: 575

Re: Solaris Build Failure wxWidgets 3.1.1

ONEEYEMAN,

I have no idea what you mean by trying to upgrade the OS as I am already on the latest SRU for the OS.

What were your configure options for the 2.8 version?
by nkulowiec
Fri Aug 03, 2018 2:42 pm
Forum: Platform Related Issues
Topic: Solaris Build Failure wxWidgets 3.1.1
Replies: 5
Views: 575

Re: Solaris Build Failure wxWidgets 3.1.1

Thanks for the info Dave! I was more concerned with the multitude of "was not declared in this scope" errors when we know that they're defined. The gcc/g++ method shows the "./include/wx/wxcrt.h:519:50: error: ‘wcsncasecmp’ was not declared in this scope" errors whereas the cc/g++ method gives "erro...
by nkulowiec
Fri Aug 03, 2018 12:58 pm
Forum: Platform Related Issues
Topic: Solaris Build Failure wxWidgets 3.1.1
Replies: 5
Views: 575

Solaris Build Failure wxWidgets 3.1.1

I am trying to build wxWidgets 3.1.1 on Solaris 11.3 SRU34 with gcc 5.4.0 and GNU make 3.82 and receive a ton of errors after about 5 minutes of building. ./include/wx/wxcrtbase.h:667:68: error: ‘wcsdup’ was not declared in this scope ./include/wx/wxcrtbase.h:667:68: error: ‘wcsdup’ was not declared...